Skip to content
Failed

Console Output

Skipping 49 KB.. Full Log
#8 resolve docker.io/dockercore/golang-cross:1.12.9@sha256:3ea9dcef4dd2c46d80445c0b22d6177817f4cfce22c523cc12a5a1091cb37705 done
#8 sha256:3ea9dcef4dd2c46d80445c0b22d6177817f4cfce22c523cc12a5a1091cb37705 2.63kB / 2.63kB done
#8 sha256:518d5e4626aaef11e9ad8f78c5055efce60445a5dcbfe2ba3d99df5370902367 6.97kB / 6.97kB done
#8 sha256:bbab4ec87ac4f89eaabdf68dddbd1dd930e3ad43bded38d761b89abf9389a893 7.80MB / 7.80MB 3.0s done
#8 sha256:4ae16bd4778367b46064f39554128dd2fda2803a5747fddeff74059f353391c9 50.38MB / 50.38MB 3.9s done
#8 sha256:2ea1f7804402db2da64e84a26bd591f41667ad69cd7f2a2c6106d9bb04dde260 9.98MB / 9.98MB 3.8s done
#8 sha256:96465440c20877524189ae75d361dd29e5d0df330a8dac9427f972b429fe0159 51.77MB / 51.77MB 5.8s done
#8 sha256:e0ec5610455ae43994616afca2caf7da592cb975d7474ed112baa42e5c616d17 127.97MB / 127.97MB 7.2s done
#8 sha256:16a3d8aca6cd76595d0fa99f7dcaf6c388c021bc6f5020d794e8292b88e5aac3 68.48MB / 68.48MB 6.1s done
#8 extracting sha256:4ae16bd4778367b46064f39554128dd2fda2803a5747fddeff74059f353391c9 4.5s
#8 sha256:96d705baf026261543501205212451776c49ddaa48a0347afab3494275e0fc13 125B / 125B 6.1s done
#8 sha256:39007eb4600844b025a9527ab141ae020bb350982baf0df7dd96c80c4a0f312e 270B / 270B 6.1s done
#8 sha256:4e549f0f5e64911cbbdc123a749d1ae352ad2be720fd1e2b259a802400fb412f 157.94MB / 163.50MB 8.9s
#8 sha256:c0058a8c71f2a8f493571a5456cfc99585ed21798b735f8fc54460904a3bd232 950B / 950B 6.5s done
#8 sha256:2f8d98df0991fd5b02a9f791cb766f66d83016b1b831e1b5e58438a8cb6de207 104.17MB / 290.76MB 8.9s
#8 ...

#5 [dev 1/9] FROM docker.io/library/golang:1.13.3@sha256:6a693fbaba7dd8d816...
#5 extracting sha256:b7a128769df1909f91b589d0a4a2e1c1671aebc047a9f46b4b30dfeb7308ea6a 1.9s done
#1 [internal] load .dockerignore
#1 transferring context: 73B done
#1 DONE 0.1s

#2 [internal] load build definition from Dockerfile
#2 transferring dockerfile: 3.83kB done
#2 DONE 0.1s

#3 [internal] load metadata for docker.io/dockercore/golang-cross:1.12.9@sh...
#3 DONE 0.2s

#4 [cli-build 1/5] FROM docker.io/dockercore/golang-cross:1.12.9@sha256:3ea...
#4 resolve docker.io/dockercore/golang-cross:1.12.9@sha256:3ea9dcef4dd2c46d80445c0b22d6177817f4cfce22c523cc12a5a1091cb37705 done
#4 sha256:2ea1f7804402db2da64e84a26bd591f41667ad69cd7f2a2c6106d9bb04dde260 0B / 9.98MB 0.1s
#4 sha256:3ea9dcef4dd2c46d80445c0b22d6177817f4cfce22c523cc12a5a1091cb37705 2.63kB / 2.63kB done
#4 sha256:4ae16bd4778367b46064f39554128dd2fda2803a5747fddeff74059f353391c9 0B / 50.38MB 0.1s
#4 sha256:bbab4ec87ac4f89eaabdf68dddbd1dd930e3ad43bded38d761b89abf9389a893 1.67MB / 7.80MB 0.1s
#4 sha256:518d5e4626aaef11e9ad8f78c5055efce60445a5dcbfe2ba3d99df5370902367 6.97kB / 6.97kB done
#4 sha256:2ea1f7804402db2da64e84a26bd591f41667ad69cd7f2a2c6106d9bb04dde260 3.53MB / 9.98MB 0.2s
#4 sha256:4ae16bd4778367b46064f39554128dd2fda2803a5747fddeff74059f353391c9 4.52MB / 50.38MB 0.2s
#4 sha256:bbab4ec87ac4f89eaabdf68dddbd1dd930e3ad43bded38d761b89abf9389a893 5.81MB / 7.80MB 0.2s
#4 sha256:2ea1f7804402db2da64e84a26bd591f41667ad69cd7f2a2c6106d9bb04dde260 9.98MB / 9.98MB 0.4s
#4 sha256:4ae16bd4778367b46064f39554128dd2fda2803a5747fddeff74059f353391c9 21.95MB / 50.38MB 0.4s
#4 sha256:bbab4ec87ac4f89eaabdf68dddbd1dd930e3ad43bded38d761b89abf9389a893 7.80MB / 7.80MB 0.2s done
#4 sha256:96465440c20877524189ae75d361dd29e5d0df330a8dac9427f972b429fe0159 0B / 51.77MB 0.4s
#4 sha256:2ea1f7804402db2da64e84a26bd591f41667ad69cd7f2a2c6106d9bb04dde260 9.98MB / 9.98MB 0.4s done
#4 sha256:4ae16bd4778367b46064f39554128dd2fda2803a5747fddeff74059f353391c9 32.55MB / 50.38MB 0.6s
#4 sha256:96465440c20877524189ae75d361dd29e5d0df330a8dac9427f972b429fe0159 10.76MB / 51.77MB 0.6s
#4 sha256:16a3d8aca6cd76595d0fa99f7dcaf6c388c021bc6f5020d794e8292b88e5aac3 8.65MB / 68.48MB 0.6s
#4 sha256:4ae16bd4778367b46064f39554128dd2fda2803a5747fddeff74059f353391c9 39.91MB / 50.38MB 0.7s
#4 sha256:96465440c20877524189ae75d361dd29e5d0df330a8dac9427f972b429fe0159 13.49MB / 51.77MB 0.7s
#4 sha256:16a3d8aca6cd76595d0fa99f7dcaf6c388c021bc6f5020d794e8292b88e5aac3 13.87MB / 68.48MB 0.7s
#4 sha256:4ae16bd4778367b46064f39554128dd2fda2803a5747fddeff74059f353391c9 46.30MB / 50.38MB 0.9s
#4 sha256:96465440c20877524189ae75d361dd29e5d0df330a8dac9427f972b429fe0159 21.24MB / 51.77MB 0.9s
#4 sha256:16a3d8aca6cd76595d0fa99f7dcaf6c388c021bc6f5020d794e8292b88e5aac3 18.20MB / 68.48MB 0.9s
#4 sha256:4ae16bd4778367b46064f39554128dd2fda2803a5747fddeff74059f353391c9 50.38MB / 50.38MB 1.1s done
#4 sha256:96465440c20877524189ae75d361dd29e5d0df330a8dac9427f972b429fe0159 31.02MB / 51.77MB 1.2s
#4 sha256:16a3d8aca6cd76595d0fa99f7dcaf6c388c021bc6f5020d794e8292b88e5aac3 27.05MB / 68.48MB 1.2s
#4 sha256:e0ec5610455ae43994616afca2caf7da592cb975d7474ed112baa42e5c616d17 0B / 127.97MB 1.2s
#5 extracting sha256:1128949d0793d2435bb1f0640a777f32feee88b71d4fe234121c3cfb345a80c4
#1 [internal] load .dockerignore
#1 transferring context:
#1 transferring context: 73B done
#1 DONE 0.5s

#2 [internal] load build definition from Dockerfile.invocation-image
#2 transferring dockerfile: 614B done
#2 DONE 0.5s

#4 [internal] load metadata for docker.io/library/alpine:3.10.3
#4 DONE 0.6s

#3 [internal] load metadata for docker.io/library/golang:1.13.2
#3 DONE 0.5s

#7 [build 1/5] FROM docker.io/library/golang:1.13.2@sha256:b3086f21bfbe8969...
#7 resolve docker.io/library/golang:1.13.2@sha256:b3086f21bfbe896973dd6147b46f2736a7deb2c04ed76219835befa0244a9562 done
#4 sha256:96465440c20877524189ae75d361dd29e5d0df330a8dac9427f972b429fe0159 36.94MB / 51.77MB 1.5s
#4 sha256:16a3d8aca6cd76595d0fa99f7dcaf6c388c021bc6f5020d794e8292b88e5aac3 33.82MB / 68.48MB 1.5s
#7 sha256:e37698ff73511ad444a1a3547b81c3f1650f7b34bfc99bd46efccf1d90024db4 5.46kB / 5.46kB done
#7 sha256:c7b7d16361e00faca0e9393f3f43923f25ceb1210face87839dfc5de988905c1 33.30kB / 50.38MB 0.1s
#7 sha256:b3086f21bfbe896973dd6147b46f2736a7deb2c04ed76219835befa0244a9562 2.16kB / 2.16kB done
#7 sha256:36c384d8593f8989b7a50bebf9569c9f6a43a6881baa8a248a84251d2ca17ddb 1.79kB / 1.79kB done
#7 sha256:b7a128769df1909f91b589d0a4a2e1c1671aebc047a9f46b4b30dfeb7308ea6a 0B / 7.81MB 0.1s
#4 sha256:e0ec5610455ae43994616afca2caf7da592cb975d7474ed112baa42e5c616d17 8.54MB / 127.97MB 1.6s
#4 extracting sha256:4ae16bd4778367b46064f39554128dd2fda2803a5747fddeff74059f353391c9
#4 sha256:96465440c20877524189ae75d361dd29e5d0df330a8dac9427f972b429fe0159 41.89MB / 51.77MB 1.7s
#4 sha256:16a3d8aca6cd76595d0fa99f7dcaf6c388c021bc6f5020d794e8292b88e5aac3 40.33MB / 68.48MB 1.7s
#7 sha256:c7b7d16361e00faca0e9393f3f43923f25ceb1210face87839dfc5de988905c1 7.83MB / 50.38MB 0.4s
#7 sha256:b7a128769df1909f91b589d0a4a2e1c1671aebc047a9f46b4b30dfeb7308ea6a 7.81MB / 7.81MB 0.4s
#7 sha256:c7b7d16361e00faca0e9393f3f43923f25ceb1210face87839dfc5de988905c1 12.31MB / 50.38MB 0.5s
#4 sha256:96465440c20877524189ae75d361dd29e5d0df330a8dac9427f972b429fe0159 46.19MB / 51.77MB 1.9s
#4 sha256:16a3d8aca6cd76595d0fa99f7dcaf6c388c021bc6f5020d794e8292b88e5aac3 45.66MB / 68.48MB 1.9s
#4 sha256:e0ec5610455ae43994616afca2caf7da592cb975d7474ed112baa42e5c616d17 19.39MB / 127.97MB 1.9s
#4 sha256:96465440c20877524189ae75d361dd29e5d0df330a8dac9427f972b429fe0159 48.83MB / 51.77MB 2.0s
#7 sha256:b7a128769df1909f91b589d0a4a2e1c1671aebc047a9f46b4b30dfeb7308ea6a 7.81MB / 7.81MB 0.5s done
#7 sha256:1128949d0793d2435bb1f0640a777f32feee88b71d4fe234121c3cfb345a80c4 0B / 10.00MB 0.7s
#7 sha256:667692510b7038b74e221f92eb33610e4968b669c8a718378ecb1f78739c3713 0B / 51.77MB 0.7s
#5 extracting sha256:1128949d0793d2435bb1f0640a777f32feee88b71d4fe234121c3cfb345a80c4 0.9s done
#5 extracting sha256:667692510b7038b74e221f92eb33610e4968b669c8a718378ecb1f78739c3713
#4 sha256:96465440c20877524189ae75d361dd29e5d0df330a8dac9427f972b429fe0159 51.77MB / 51.77MB 2.1s
#4 sha256:16a3d8aca6cd76595d0fa99f7dcaf6c388c021bc6f5020d794e8292b88e5aac3 51.17MB / 68.48MB 2.1s
#4 sha256:96465440c20877524189ae75d361dd29e5d0df330a8dac9427f972b429fe0159 51.77MB / 51.77MB 2.2s done
#4 sha256:e0ec5610455ae43994616afca2caf7da592cb975d7474ed112baa42e5c616d17 31.59MB / 127.97MB 2.3s
#4 sha256:96d705baf026261543501205212451776c49ddaa48a0347afab3494275e0fc13 0B / 125B 2.3s
#7 sha256:c7b7d16361e00faca0e9393f3f43923f25ceb1210face87839dfc5de988905c1 17.20MB / 50.38MB 1.0s
#7 sha256:1128949d0793d2435bb1f0640a777f32feee88b71d4fe234121c3cfb345a80c4 3.03MB / 10.00MB 1.0s
#4 sha256:16a3d8aca6cd76595d0fa99f7dcaf6c388c021bc6f5020d794e8292b88e5aac3 59.02MB / 68.48MB 2.4s
#4 sha256:96d705baf026261543501205212451776c49ddaa48a0347afab3494275e0fc13 125B / 125B 2.3s done
#4 sha256:39007eb4600844b025a9527ab141ae020bb350982baf0df7dd96c80c4a0f312e 0B / 270B 2.4s
#7 sha256:1128949d0793d2435bb1f0640a777f32feee88b71d4fe234121c3cfb345a80c4 4.86MB / 10.00MB 1.1s
#4 sha256:e0ec5610455ae43994616afca2caf7da592cb975d7474ed112baa42e5c616d17 46.35MB / 127.97MB 2.6s
#4 sha256:39007eb4600844b025a9527ab141ae020bb350982baf0df7dd96c80c4a0f312e 270B / 270B 2.4s done
#4 sha256:4e549f0f5e64911cbbdc123a749d1ae352ad2be720fd1e2b259a802400fb412f 0B / 163.50MB 2.6s
#4 sha256:16a3d8aca6cd76595d0fa99f7dcaf6c388c021bc6f5020d794e8292b88e5aac3 67.76MB / 68.48MB 2.8s
#7 sha256:c7b7d16361e00faca0e9393f3f43923f25ceb1210face87839dfc5de988905c1 22.80MB / 50.38MB 1.5s
#7 sha256:1128949d0793d2435bb1f0640a777f32feee88b71d4fe234121c3cfb345a80c4 8.97MB / 10.00MB 1.5s
#7 sha256:667692510b7038b74e221f92eb33610e4968b669c8a718378ecb1f78739c3713 6.39MB / 51.77MB 1.5s
#7 sha256:1128949d0793d2435bb1f0640a777f32feee88b71d4fe234121c3cfb345a80c4 10.00MB / 10.00MB 1.6s
#7 sha256:667692510b7038b74e221f92eb33610e4968b669c8a718378ecb1f78739c3713 10.35MB / 51.77MB 1.6s
#4 sha256:e0ec5610455ae43994616afca2caf7da592cb975d7474ed112baa42e5c616d17 53.77MB / 127.97MB 2.9s
#4 sha256:e0ec5610455ae43994616afca2caf7da592cb975d7474ed112baa42e5c616d17 61.17MB / 127.97MB 3.1s
#4 sha256:4e549f0f5e64911cbbdc123a749d1ae352ad2be720fd1e2b259a802400fb412f 14.11MB / 163.50MB 3.1s
#7 sha256:c7b7d16361e00faca0e9393f3f43923f25ceb1210face87839dfc5de988905c1 26.08MB / 50.38MB 1.7s
#7 sha256:667692510b7038b74e221f92eb33610e4968b669c8a718378ecb1f78739c3713 14.80MB / 51.77MB 1.7s
#4 sha256:16a3d8aca6cd76595d0fa99f7dcaf6c388c021bc6f5020d794e8292b88e5aac3 68.48MB / 68.48MB 3.1s done
#4 sha256:c0058a8c71f2a8f493571a5456cfc99585ed21798b735f8fc54460904a3bd232 0B / 950B 3.2s
#4 sha256:e0ec5610455ae43994616afca2caf7da592cb975d7474ed112baa42e5c616d17 67.68MB / 127.97MB 3.3s
#4 sha256:4e549f0f5e64911cbbdc123a749d1ae352ad2be720fd1e2b259a802400fb412f 23.14MB / 163.50MB 3.3s
#4 sha256:c0058a8c71f2a8f493571a5456cfc99585ed21798b735f8fc54460904a3bd232 950B / 950B 3.2s done
#4 sha256:2f8d98df0991fd5b02a9f791cb766f66d83016b1b831e1b5e58438a8cb6de207 0B / 290.76MB 3.3s
#7 sha256:c7b7d16361e00faca0e9393f3f43923f25ceb1210face87839dfc5de988905c1 30.48MB / 50.38MB 1.9s
#7 sha256:1128949d0793d2435bb1f0640a777f32feee88b71d4fe234121c3cfb345a80c4 10.00MB / 10.00MB 1.7s done
#7 sha256:667692510b7038b74e221f92eb33610e4968b669c8a718378ecb1f78739c3713 18.28MB / 51.77MB 1.9s
#7 sha256:c70d80036479d598a6173d377ad1e726df898511a98ba73896f3798635e41f62 1.90MB / 68.52MB 1.9s
#4 sha256:e0ec5610455ae43994616afca2caf7da592cb975d7474ed112baa42e5c616d17 77.81MB / 127.97MB 3.5s
#4 sha256:4e549f0f5e64911cbbdc123a749d1ae352ad2be720fd1e2b259a802400fb412f 33.85MB / 163.50MB 3.7s
#7 sha256:c7b7d16361e00faca0e9393f3f43923f25ceb1210face87839dfc5de988905c1 34.76MB / 50.38MB 2.1s
#7 sha256:c70d80036479d598a6173d377ad1e726df898511a98ba73896f3798635e41f62 7.18MB / 68.52MB 2.1s
#7 sha256:c7b7d16361e00faca0e9393f3f43923f25ceb1210face87839dfc5de988905c1 37.76MB / 50.38MB 2.3s
#7 sha256:667692510b7038b74e221f92eb33610e4968b669c8a718378ecb1f78739c3713 23.37MB / 51.77MB 2.3s
#7 sha256:667692510b7038b74e221f92eb33610e4968b669c8a718378ecb1f78739c3713 26.66MB / 51.77MB 2.5s
#7 sha256:c70d80036479d598a6173d377ad1e726df898511a98ba73896f3798635e41f62 12.44MB / 68.52MB 2.5s
#4 sha256:e0ec5610455ae43994616afca2caf7da592cb975d7474ed112baa42e5c616d17 85.42MB / 127.97MB 3.8s
#7 sha256:c7b7d16361e00faca0e9393f3f43923f25ceb1210face87839dfc5de988905c1 42.06MB / 50.38MB 2.5s
#7 sha256:c7b7d16361e00faca0e9393f3f43923f25ceb1210face87839dfc5de988905c1 44.98MB / 50.38MB 2.6s
#7 sha256:667692510b7038b74e221f92eb33610e4968b669c8a718378ecb1f78739c3713 30.57MB / 51.77MB 2.6s
#4 sha256:4e549f0f5e64911cbbdc123a749d1ae352ad2be720fd1e2b259a802400fb412f 44.83MB / 163.50MB 3.9s
#4 sha256:2f8d98df0991fd5b02a9f791cb766f66d83016b1b831e1b5e58438a8cb6de207 17.60MB / 290.76MB 3.9s
#7 sha256:c7b7d16361e00faca0e9393f3f43923f25ceb1210face87839dfc5de988905c1 49.02MB / 50.38MB 2.8s
#7 sha256:667692510b7038b74e221f92eb33610e4968b669c8a718378ecb1f78739c3713 35.19MB / 51.77MB 2.8s
#7 sha256:c70d80036479d598a6173d377ad1e726df898511a98ba73896f3798635e41f62 16.55MB / 68.52MB 2.8s
#7 sha256:667692510b7038b74e221f92eb33610e4968b669c8a718378ecb1f78739c3713 41.00MB / 51.77MB 2.9s
#7 sha256:c70d80036479d598a6173d377ad1e726df898511a98ba73896f3798635e41f62 21.68MB / 68.52MB 2.9s
#4 sha256:e0ec5610455ae43994616afca2caf7da592cb975d7474ed112baa42e5c616d17 101.34MB / 127.97MB 4.2s
#4 sha256:4e549f0f5e64911cbbdc123a749d1ae352ad2be720fd1e2b259a802400fb412f 53.53MB / 163.50MB 4.2s
#7 sha256:667692510b7038b74e221f92eb33610e4968b669c8a718378ecb1f78739c3713 50.59MB / 51.77MB 3.1s
#7 sha256:c70d80036479d598a6173d377ad1e726df898511a98ba73896f3798635e41f62 28.69MB / 68.52MB 3.1s
#4 sha256:e0ec5610455ae43994616afca2caf7da592cb975d7474ed112baa42e5c616d17 109.49MB / 127.97MB 4.4s
#4 sha256:e0ec5610455ae43994616afca2caf7da592cb975d7474ed112baa42e5c616d17 115.95MB / 127.97MB 4.6s
#4 sha256:4e549f0f5e64911cbbdc123a749d1ae352ad2be720fd1e2b259a802400fb412f 64.03MB / 163.50MB 4.6s
#4 sha256:2f8d98df0991fd5b02a9f791cb766f66d83016b1b831e1b5e58438a8cb6de207 35.48MB / 290.76MB 4.6s
#7 sha256:c70d80036479d598a6173d377ad1e726df898511a98ba73896f3798635e41f62 39.95MB / 68.52MB 3.4s
#4 sha256:e0ec5610455ae43994616afca2caf7da592cb975d7474ed112baa42e5c616d17 125.21MB / 127.97MB 4.9s
#4 sha256:4e549f0f5e64911cbbdc123a749d1ae352ad2be720fd1e2b259a802400fb412f 72.32MB / 163.50MB 4.9s
#7 sha256:c70d80036479d598a6173d377ad1e726df898511a98ba73896f3798635e41f62 49.60MB / 68.52MB 3.5s
#7 sha256:c70d80036479d598a6173d377ad1e726df898511a98ba73896f3798635e41f62 55.40MB / 68.52MB 3.6s
#4 sha256:2f8d98df0991fd5b02a9f791cb766f66d83016b1b831e1b5e58438a8cb6de207 50.80MB / 290.76MB 5.1s
#7 sha256:c70d80036479d598a6173d377ad1e726df898511a98ba73896f3798635e41f62 59.95MB / 68.52MB 3.8s
#4 sha256:4e549f0f5e64911cbbdc123a749d1ae352ad2be720fd1e2b259a802400fb412f 82.97MB / 163.50MB 5.3s
#5 extracting sha256:667692510b7038b74e221f92eb33610e4968b669c8a718378ecb1f78739c3713 3.1s done
#7 sha256:c70d80036479d598a6173d377ad1e726df898511a98ba73896f3798635e41f62 66.31MB / 68.52MB 4.1s
#4 sha256:2f8d98df0991fd5b02a9f791cb766f66d83016b1b831e1b5e58438a8cb6de207 66.21MB / 290.76MB 5.5s
#4 sha256:e0ec5610455ae43994616afca2caf7da592cb975d7474ed112baa42e5c616d17 127.97MB / 127.97MB 5.5s done
#4 sha256:4e549f0f5e64911cbbdc123a749d1ae352ad2be720fd1e2b259a802400fb412f 96.85MB / 163.50MB 5.7s
#5 extracting sha256:c70d80036479d598a6173d377ad1e726df898511a98ba73896f3798635e41f62
#4 sha256:2f8d98df0991fd5b02a9f791cb766f66d83016b1b831e1b5e58438a8cb6de207 83.39MB / 290.76MB 5.8s
#4 sha256:4e549f0f5e64911cbbdc123a749d1ae352ad2be720fd1e2b259a802400fb412f 107.33MB / 163.50MB 6.0s
#5 ...

#8 [cli-build 1/5] FROM docker.io/dockercore/golang-cross:1.12.9@sha256:3ea...
#8 extracting sha256:4ae16bd4778367b46064f39554128dd2fda2803a5747fddeff74059f353391c9 8.4s done
#8 sha256:4e549f0f5e64911cbbdc123a749d1ae352ad2be720fd1e2b259a802400fb412f 163.50MB / 163.50MB 10.7s done
#8 sha256:2f8d98df0991fd5b02a9f791cb766f66d83016b1b831e1b5e58438a8cb6de207 290.76MB / 290.76MB 14.5s done
#8 extracting sha256:bbab4ec87ac4f89eaabdf68dddbd1dd930e3ad43bded38d761b89abf9389a893 0.5s done
#8 extracting sha256:2ea1f7804402db2da64e84a26bd591f41667ad69cd7f2a2c6106d9bb04dde260 0.3s done
#8 extracting sha256:96465440c20877524189ae75d361dd29e5d0df330a8dac9427f972b429fe0159
#4 sha256:2f8d98df0991fd5b02a9f791cb766f66d83016b1b831e1b5e58438a8cb6de207 99.37MB / 290.76MB 6.2s
#7 sha256:c7b7d16361e00faca0e9393f3f43923f25ceb1210face87839dfc5de988905c1 50.38MB / 50.38MB 4.2s done
#7 sha256:667692510b7038b74e221f92eb33610e4968b669c8a718378ecb1f78739c3713 51.77MB / 51.77MB 4.3s done
#7 extracting sha256:c7b7d16361e00faca0e9393f3f43923f25ceb1210face87839dfc5de988905c1
#7 sha256:a8669f8c1a42cfd3644fcda9f2cc2ab189e823018abce1ad7c97cbd62c6190de 2.08MB / 120.05MB 4.6s
#7 sha256:433331673060b0f68a5fc1217a3bd3ad4db5fe61193a145e1ac460d324fb2f9c 0B / 126B 4.6s
#7 sha256:433331673060b0f68a5fc1217a3bd3ad4db5fe61193a145e1ac460d324fb2f9c 126B / 126B 4.8s done
#4 sha256:4e549f0f5e64911cbbdc123a749d1ae352ad2be720fd1e2b259a802400fb412f 121.55MB / 163.50MB 6.4s
#7 sha256:a8669f8c1a42cfd3644fcda9f2cc2ab189e823018abce1ad7c97cbd62c6190de 8.25MB / 120.05MB 5.1s
#4 extracting sha256:4ae16bd4778367b46064f39554128dd2fda2803a5747fddeff74059f353391c9 5.0s
#4 sha256:4e549f0f5e64911cbbdc123a749d1ae352ad2be720fd1e2b259a802400fb412f 132.03MB / 163.50MB 6.6s
#4 sha256:2f8d98df0991fd5b02a9f791cb766f66d83016b1b831e1b5e58438a8cb6de207 115.61MB / 290.76MB 6.6s
#7 sha256:a8669f8c1a42cfd3644fcda9f2cc2ab189e823018abce1ad7c97cbd62c6190de 19.08MB / 120.05MB 5.5s
#4 sha256:4e549f0f5e64911cbbdc123a749d1ae352ad2be720fd1e2b259a802400fb412f 142.66MB / 163.50MB 6.9s
#7 ...

#5 [invocation 1/4] FROM docker.io/library/alpine:3.10.3@sha256:c19173c5ada...
#5 resolve docker.io/library/alpine:3.10.3@sha256:c19173c5ada610a5989151111163d28a67368362762534d8a8121ce95cf2bd5a done
#5 sha256:e4355b66995c96b4b468159fc5c7e3540fcef961189ca13fee877798649f531a 528B / 528B done
#5 sha256:965ea09ff2ebd2b9eeec88cd822ce156f6674c7e99be082c7efac3c62f3ff652 1.51kB / 1.51kB done
#5 sha256:89d9c30c1d48bac627e5c6cb0d1ed1eec28e7dbdfbcc04712e4c79c0f83faf17 2.79MB / 2.79MB 0.6s done
#5 sha256:c19173c5ada610a5989151111163d28a67368362762534d8a8121ce95cf2bd5a 1.64kB / 1.64kB done
#5 extracting sha256:89d9c30c1d48bac627e5c6cb0d1ed1eec28e7dbdfbcc04712e4c79c0f83faf17 2.5s done
#5 DONE 5.7s

#7 [build 1/5] FROM docker.io/library/golang:1.13.2@sha256:b3086f21bfbe8969...
#7 sha256:c70d80036479d598a6173d377ad1e726df898511a98ba73896f3798635e41f62 68.52MB / 68.52MB 5.6s done
#7 ...

#6 [invocation 2/4] RUN apk add --no-cache ca-certificates && adduser -S cn...
#4 sha256:2f8d98df0991fd5b02a9f791cb766f66d83016b1b831e1b5e58438a8cb6de207 133.42MB / 290.76MB 7.1s
#4 sha256:4e549f0f5e64911cbbdc123a749d1ae352ad2be720fd1e2b259a802400fb412f 154.45MB / 163.50MB 7.2s
#4 sha256:4e549f0f5e64911cbbdc123a749d1ae352ad2be720fd1e2b259a802400fb412f 163.50MB / 163.50MB 7.5s
#4 sha256:2f8d98df0991fd5b02a9f791cb766f66d83016b1b831e1b5e58438a8cb6de207 149.59MB / 290.76MB 7.5s
#4 sha256:4e549f0f5e64911cbbdc123a749d1ae352ad2be720fd1e2b259a802400fb412f 163.50MB / 163.50MB 7.7s done
#4 sha256:2f8d98df0991fd5b02a9f791cb766f66d83016b1b831e1b5e58438a8cb6de207 172.22MB / 290.76MB 7.9s
#4 sha256:2f8d98df0991fd5b02a9f791cb766f66d83016b1b831e1b5e58438a8cb6de207 191.16MB / 290.76MB 8.3s
#4 sha256:2f8d98df0991fd5b02a9f791cb766f66d83016b1b831e1b5e58438a8cb6de207 207.84MB / 290.76MB 8.8s
#4 sha256:2f8d98df0991fd5b02a9f791cb766f66d83016b1b831e1b5e58438a8cb6de207 223.87MB / 290.76MB 9.2s
#4 sha256:2f8d98df0991fd5b02a9f791cb766f66d83016b1b831e1b5e58438a8cb6de207 240.41MB / 290.76MB 9.8s
#8 extracting sha256:96465440c20877524189ae75d361dd29e5d0df330a8dac9427f972b429fe0159 3.8s done
#8 extracting sha256:16a3d8aca6cd76595d0fa99f7dcaf6c388c021bc6f5020d794e8292b88e5aac3
#6 2.853 fetch http://dl-cdn.alpinelinux.org/alpine/v3.10/main/x86_64/APKINDEX.tar.gz
#4 sha256:2f8d98df0991fd5b02a9f791cb766f66d83016b1b831e1b5e58438a8cb6de207 257.08MB / 290.76MB 10.4s
#4 sha256:2f8d98df0991fd5b02a9f791cb766f66d83016b1b831e1b5e58438a8cb6de207 273.05MB / 290.76MB 10.8s
#6 ...

#10 [internal] load build context
#10 transferring context: 73.02MB 9.0s done
#10 DONE 9.4s

#7 [build 1/5] FROM docker.io/library/golang:1.13.2@sha256:b3086f21bfbe8969...
#7 sha256:a8669f8c1a42cfd3644fcda9f2cc2ab189e823018abce1ad7c97cbd62c6190de 120.05MB / 120.05MB 9.5s
#7 extracting sha256:c7b7d16361e00faca0e9393f3f43923f25ceb1210face87839dfc5de988905c1 5.1s
#4 sha256:2f8d98df0991fd5b02a9f791cb766f66d83016b1b831e1b5e58438a8cb6de207 290.76MB / 290.76MB 11.4s
#4 extracting sha256:4ae16bd4778367b46064f39554128dd2fda2803a5747fddeff74059f353391c9 9.9s done
#4 extracting sha256:bbab4ec87ac4f89eaabdf68dddbd1dd930e3ad43bded38d761b89abf9389a893
#4 sha256:2f8d98df0991fd5b02a9f791cb766f66d83016b1b831e1b5e58438a8cb6de207 290.76MB / 290.76MB 12.0s done
#4 extracting sha256:bbab4ec87ac4f89eaabdf68dddbd1dd930e3ad43bded38d761b89abf9389a893 0.6s done
#4 extracting sha256:2ea1f7804402db2da64e84a26bd591f41667ad69cd7f2a2c6106d9bb04dde260 0.1s
#4 extracting sha256:2ea1f7804402db2da64e84a26bd591f41667ad69cd7f2a2c6106d9bb04dde260 0.5s done
#4 extracting sha256:96465440c20877524189ae75d361dd29e5d0df330a8dac9427f972b429fe0159 0.1s
#7 sha256:a8669f8c1a42cfd3644fcda9f2cc2ab189e823018abce1ad7c97cbd62c6190de 120.05MB / 120.05MB 11.9s done
#7 extracting sha256:c7b7d16361e00faca0e9393f3f43923f25ceb1210face87839dfc5de988905c1 8.0s done
#8 extracting sha256:16a3d8aca6cd76595d0fa99f7dcaf6c388c021bc6f5020d794e8292b88e5aac3 3.9s done
#8 extracting sha256:e0ec5610455ae43994616afca2caf7da592cb975d7474ed112baa42e5c616d17
#7 extracting sha256:b7a128769df1909f91b589d0a4a2e1c1671aebc047a9f46b4b30dfeb7308ea6a
#7 extracting sha256:b7a128769df1909f91b589d0a4a2e1c1671aebc047a9f46b4b30dfeb7308ea6a 0.5s done
#8 ...

#5 [dev 1/9] FROM docker.io/library/golang:1.13.3@sha256:6a693fbaba7dd8d816...
#5 extracting sha256:c70d80036479d598a6173d377ad1e726df898511a98ba73896f3798635e41f62 4.1s done
#5 extracting sha256:f332e1ccc3d895f13e9660c053e8bda16c4894c5179526cf7702ad014cd5fa88 5.8s
#5 ...

#8 [cli-build 1/5] FROM docker.io/dockercore/golang-cross:1.12.9@sha256:3ea...
#7 extracting sha256:1128949d0793d2435bb1f0640a777f32feee88b71d4fe234121c3cfb345a80c4
#7 extracting sha256:1128949d0793d2435bb1f0640a777f32feee88b71d4fe234121c3cfb345a80c4 0.5s done
#4 extracting sha256:96465440c20877524189ae75d361dd29e5d0df330a8dac9427f972b429fe0159 3.8s done
#4 extracting sha256:16a3d8aca6cd76595d0fa99f7dcaf6c388c021bc6f5020d794e8292b88e5aac3
#7 extracting sha256:667692510b7038b74e221f92eb33610e4968b669c8a718378ecb1f78739c3713 0.1s
#8 ...

#5 [dev 1/9] FROM docker.io/library/golang:1.13.3@sha256:6a693fbaba7dd8d816...
#5 extracting sha256:f332e1ccc3d895f13e9660c053e8bda16c4894c5179526cf7702ad014cd5fa88 7.6s done
#5 extracting sha256:07e0a3e016334dc43ddfb498264511edf2341c6a4c9ceea921f6100e70bae220 done
#5 DONE 28.3s

#8 [cli-build 1/5] FROM docker.io/dockercore/golang-cross:1.12.9@sha256:3ea...
#7 ...

#6 [invocation 2/4] RUN apk add --no-cache ca-certificates && adduser -S cn...
#6 3.962 fetch http://dl-cdn.alpinelinux.org/alpine/v3.10/community/x86_64/APKINDEX.tar.gz
#6 4.081 (1/1) Installing ca-certificates (20190108-r0)
#6 4.237 Executing busybox-1.30.1-r2.trigger
#6 4.243 Executing ca-certificates-20190108-r0.trigger
#6 4.289 OK: 6 MiB in 15 packages
#6 DONE 12.1s

#7 [build 1/5] FROM docker.io/library/golang:1.13.2@sha256:b3086f21bfbe8969...
#8 extracting sha256:e0ec5610455ae43994616afca2caf7da592cb975d7474ed112baa42e5c616d17 5.3s
#4 extracting sha256:16a3d8aca6cd76595d0fa99f7dcaf6c388c021bc6f5020d794e8292b88e5aac3 3.7s done
#4 extracting sha256:e0ec5610455ae43994616afca2caf7da592cb975d7474ed112baa42e5c616d17 0.1s
#8 extracting sha256:e0ec5610455ae43994616afca2caf7da592cb975d7474ed112baa42e5c616d17 7.1s done
#8 extracting sha256:96d705baf026261543501205212451776c49ddaa48a0347afab3494275e0fc13
#8 extracting sha256:96d705baf026261543501205212451776c49ddaa48a0347afab3494275e0fc13 done
#8 extracting sha256:39007eb4600844b025a9527ab141ae020bb350982baf0df7dd96c80c4a0f312e done
#8 extracting sha256:4e549f0f5e64911cbbdc123a749d1ae352ad2be720fd1e2b259a802400fb412f
#7 extracting sha256:667692510b7038b74e221f92eb33610e4968b669c8a718378ecb1f78739c3713 4.3s done
#7 extracting sha256:c70d80036479d598a6173d377ad1e726df898511a98ba73896f3798635e41f62
#7 extracting sha256:c70d80036479d598a6173d377ad1e726df898511a98ba73896f3798635e41f62 3.6s done
#7 extracting sha256:a8669f8c1a42cfd3644fcda9f2cc2ab189e823018abce1ad7c97cbd62c6190de
#4 extracting sha256:e0ec5610455ae43994616afca2caf7da592cb975d7474ed112baa42e5c616d17 5.1s done
#4 extracting sha256:96d705baf026261543501205212451776c49ddaa48a0347afab3494275e0fc13
#4 extracting sha256:96d705baf026261543501205212451776c49ddaa48a0347afab3494275e0fc13 done
#4 extracting sha256:39007eb4600844b025a9527ab141ae020bb350982baf0df7dd96c80c4a0f312e
#4 extracting sha256:39007eb4600844b025a9527ab141ae020bb350982baf0df7dd96c80c4a0f312e done
#4 extracting sha256:4e549f0f5e64911cbbdc123a749d1ae352ad2be720fd1e2b259a802400fb412f
#8 extracting sha256:4e549f0f5e64911cbbdc123a749d1ae352ad2be720fd1e2b259a802400fb412f 5.1s
#8 ...

#6 [dev 2/9] RUN apt-get update && apt-get install -y -q --no-install-recom...
#6 1.652 Get:1 http://security.debian.org/debian-security buster/updates InRelease [39.1 kB]
#6 1.736 Get:2 http://deb.debian.org/debian buster InRelease [122 kB]
#6 1.793 Get:3 http://deb.debian.org/debian buster-updates InRelease [49.3 kB]
#6 1.974 Get:4 http://security.debian.org/debian-security buster/updates/main amd64 Packages [113 kB]
#6 2.197 Get:5 http://deb.debian.org/debian buster/main amd64 Packages [7899 kB]
#6 2.598 Get:6 http://deb.debian.org/debian buster-updates/main amd64 Packages [5792 B]
#6 4.141 Fetched 8227 kB in 3s (3008 kB/s)
#6 4.141 Reading package lists...
#6 5.143 Reading package lists...
#6 6.140 Building dependency tree...
#6 6.356 Reading state information...
#6 6.609 coreutils is already the newest version (8.30-3).
#6 6.609 coreutils set to manually installed.
#6 6.609 util-linux is already the newest version (2.33.1-0.1).
#6 6.609 util-linux set to manually installed.
#6 6.609 The following NEW packages will be installed:
#6 6.609   uuid-runtime
#6 6.878 0 upgraded, 1 newly installed, 0 to remove and 0 not upgraded.
#6 6.878 Need to get 95.2 kB of archives.
#6 6.878 After this operation, 211 kB of additional disk space will be used.
#6 6.878 Get:1 http://deb.debian.org/debian buster/main amd64 uuid-runtime amd64 2.33.1-0.1 [95.2 kB]
#6 7.043 debconf: delaying package configuration, since apt-utils is not installed
#6 7.079 Fetched 95.2 kB in 0s (361 kB/s)
#6 7.117 Selecting previously unselected package uuid-runtime.
#6 7.117 (Reading database ... 
(Reading database ... 5%
(Reading database ... 10%
(Reading database ... 15%
(Reading database ... 20%
(Reading database ... 25%
(Reading database ... 30%
(Reading database ... 35%
(Reading database ... 40%
(Reading database ... 45%
(Reading database ... 50%
(Reading database ... 55%
(Reading database ... 60%
(Reading database ... 65%
(Reading database ... 70%
(Reading database ... 75%
(Reading database ... 80%
(Reading database ... 85%
(Reading database ... 90%
(Reading database ... 95%
(Reading database ... 100%
(Reading database ... 15394 files and directories currently installed.)
#6 7.122 Preparing to unpack .../uuid-runtime_2.33.1-0.1_amd64.deb ...
#6 7.128 Unpacking uuid-runtime (2.33.1-0.1) ...
#6 7.202 Setting up uuid-runtime (2.33.1-0.1) ...
#6 7.385 Adding group `uuidd' (GID 102) ...
#6 7.405 Done.
#6 7.441 Warning: The home dir /run/uuidd you specified can't be accessed: No such file or directory
#6 7.441 Adding system user `uuidd' (UID 101) ...
#6 7.441 Adding new user `uuidd' (UID 101) with group `uuidd' ...
#6 8.047 Not creating home directory `/run/uuidd'.
#6 8.061 invoke-rc.d: could not determine current runlevel
#6 8.076 invoke-rc.d: policy-rc.d denied execution of start.
#6 ...

#8 [cli-build 1/5] FROM docker.io/dockercore/golang-cross:1.12.9@sha256:3ea...
#8 extracting sha256:4e549f0f5e64911cbbdc123a749d1ae352ad2be720fd1e2b259a802400fb412f 8.1s done
#8 extracting sha256:c0058a8c71f2a8f493571a5456cfc99585ed21798b735f8fc54460904a3bd232 done
#8 extracting sha256:2f8d98df0991fd5b02a9f791cb766f66d83016b1b831e1b5e58438a8cb6de207
#7 extracting sha256:a8669f8c1a42cfd3644fcda9f2cc2ab189e823018abce1ad7c97cbd62c6190de 5.0s
#4 extracting sha256:4e549f0f5e64911cbbdc123a749d1ae352ad2be720fd1e2b259a802400fb412f 5.1s
#8 ...

#6 [dev 2/9] RUN apt-get update && apt-get install -y -q --no-install-recom...
#6 DONE 13.4s

#8 [cli-build 1/5] FROM docker.io/dockercore/golang-cross:1.12.9@sha256:3ea...
#8 ...

#7 [dev 3/9] WORKDIR /go/src/github.com/docker/app/
#7 DONE 0.8s

#8 [cli-build 1/5] FROM docker.io/dockercore/golang-cross:1.12.9@sha256:3ea...
#7 extracting sha256:a8669f8c1a42cfd3644fcda9f2cc2ab189e823018abce1ad7c97cbd62c6190de 7.6s done
#7 extracting sha256:433331673060b0f68a5fc1217a3bd3ad4db5fe61193a145e1ac460d324fb2f9c done
#7 DONE 32.9s

#8 [build 2/5] RUN apt-get update -qq && apt-get install -y -q --no-install...
#8 extracting sha256:2f8d98df0991fd5b02a9f791cb766f66d83016b1b831e1b5e58438a8cb6de207 5.1s
#4 extracting sha256:4e549f0f5e64911cbbdc123a749d1ae352ad2be720fd1e2b259a802400fb412f 10.1s
#4 extracting sha256:4e549f0f5e64911cbbdc123a749d1ae352ad2be720fd1e2b259a802400fb412f 10.9s done
#4 extracting sha256:c0058a8c71f2a8f493571a5456cfc99585ed21798b735f8fc54460904a3bd232 done
#8 3.649 Reading package lists...#4 extracting sha256:2f8d98df0991fd5b02a9f791cb766f66d83016b1b831e1b5e58438a8cb6de207

#8 4.498 Building dependency tree...
#8 4.642 Reading state information...
#8 4.802 coreutils is already the newest version (8.30-3).
#8 4.802 coreutils set to manually installed.
#8 4.802 util-linux is already the newest version (2.33.1-0.1).
#8 4.802 util-linux set to manually installed.
#8 4.802 The following NEW packages will be installed:
#8 4.802   uuid-runtime
#8 5.181 0 upgraded, 1 newly installed, 0 to remove and 0 not upgraded.
#8 5.181 Need to get 95.2 kB of archives.
#8 5.181 After this operation, 211 kB of additional disk space will be used.
#8 5.181 Get:1 http://deb.debian.org/debian buster/main amd64 uuid-runtime amd64 2.33.1-0.1 [95.2 kB]
#8 5.650 debconf: delaying package configuration, since apt-utils is not installed
#8 6.551 Fetched 95.2 kB in 1s (183 kB/s)
#8 6.786 Selecting previously unselected package uuid-runtime.
#8 6.786 (Reading database ... 
(Reading database ... 5%
(Reading database ... 10%
(Reading database ... 15%
(Reading database ... 20%
(Reading database ... 25%
(Reading database ... 30%
(Reading database ... 35%
(Reading database ... 40%
(Reading database ... 45%
(Reading database ... 50%
(Reading database ... 55%
(Reading database ... 60%
(Reading database ... 65%
(Reading database ... 70%
(Reading database ... 75%
(Reading database ... 80%
(Reading database ... 85%
(Reading database ... 90%
(Reading database ... 95%
(Reading database ... 100%
(Reading database ... 15394 files and directories currently installed.)
#8 6.796 Preparing to unpack .../uuid-runtime_2.33.1-0.1_amd64.deb ...
#8 6.812 Unpacking uuid-runtime (2.33.1-0.1) ...
#8 7.407 Setting up uuid-runtime (2.33.1-0.1) ...
#8 extracting sha256:2f8d98df0991fd5b02a9f791cb766f66d83016b1b831e1b5e58438a8cb6de207 10.1s
#8 7.764 Adding group `uuidd' (GID 102) ...
#8 8.514 Done.
#8 8.556 Warning: The home dir /run/uuidd you specified can't be accessed: No such file or directory
#8 8.557 Adding system user `uuidd' (UID 101) ...
#8 8.558 Adding new user `uuidd' (UID 101) with group `uuidd' ...
#4 extracting sha256:2f8d98df0991fd5b02a9f791cb766f66d83016b1b831e1b5e58438a8cb6de207 5.0s
#8 9.359 Not creating home directory `/run/uuidd'.
#8 9.373 invoke-rc.d: could not determine current runlevel
#8 9.377 invoke-rc.d: policy-rc.d denied execution of start.
#8 DONE 11.6s

#9 [build 3/5] WORKDIR /go/src/github.com/docker/app/
#9 DONE 0.1s

#11 [build 4/5] COPY . .
#8 extracting sha256:2f8d98df0991fd5b02a9f791cb766f66d83016b1b831e1b5e58438a8cb6de207 15.2s
#8 extracting sha256:2f8d98df0991fd5b02a9f791cb766f66d83016b1b831e1b5e58438a8cb6de207 15.3s done
#11 DONE 1.7s

#12 [build 5/5] RUN make BUILD_TAG=${BUILD_TAG} TAG=jenkins-app-PR-719-38 bi...
#8 DONE 57.6s

#9 [cli-build 2/5] RUN apt-get install -y -q --no-install-recommends   core...
#4 extracting sha256:2f8d98df0991fd5b02a9f791cb766f66d83016b1b831e1b5e58438a8cb6de207 10.1s
#12 1.398 CGO_ENABLED=0 go build -tags= -ldflags="-s -w -X github.com/docker/app/internal.GitCommit=493501a1 -X github.com/docker/app/internal.Version=jenkins-app-PR-719-38 -X github.com/docker/app/internal.BuildTime=2019-11-08T07:39:25Z" -o bin/cnab-run ./cmd/cnab-run
#9 1.156 Reading package lists...
#9 1.747 Building dependency tree...
#9 1.863 Reading state information...
#9 2.003 coreutils is already the newest version (8.30-3).
#9 2.003 coreutils set to manually installed.
#9 2.003 util-linux is already the newest version (2.33.1-0.1).
#9 2.003 util-linux set to manually installed.
#9 2.003 The following NEW packages will be installed:
#9 2.003   uuid-runtime
#9 2.275 0 upgraded, 1 newly installed, 0 to remove and 1 not upgraded.
#9 2.275 Need to get 95.2 kB of archives.
#9 2.275 After this operation, 211 kB of additional disk space will be used.
#9 2.275 Get:1 http://deb.debian.org/debian buster/main amd64 uuid-runtime amd64 2.33.1-0.1 [95.2 kB]
#9 2.523 debconf: delaying package configuration, since apt-utils is not installed
#9 2.560 Fetched 95.2 kB in 0s (365 kB/s)
#9 2.594 Selecting previously unselected package uuid-runtime.
#9 2.594 (Reading database ... 
(Reading database ... 5%
(Reading database ... 10%
(Reading database ... 15%
(Reading database ... 20%
(Reading database ... 25%
(Reading database ... 30%
(Reading database ... 35%
(Reading database ... 40%
(Reading database ... 45%
(Reading database ... 50%
(Reading database ... 55%
(Reading database ... 60%
(Reading database ... 65%
(Reading database ... 70%
(Reading database ... 75%
(Reading database ... 80%
(Reading database ... 85%
(Reading database ... 90%
(Reading database ... 95%
(Reading database ... 100%
(Reading database ... 25419 files and directories currently installed.)
#9 2.607 Preparing to unpack .../uuid-runtime_2.33.1-0.1_amd64.deb ...
#9 2.611 Unpacking uuid-runtime (2.33.1-0.1) ...
#9 2.656 Setting up uuid-runtime (2.33.1-0.1) ...
#9 2.690 Adding group `uuidd' (GID 102) ...
#9 2.710 Done.
#9 2.736 Warning: The home dir /run/uuidd you specified can't be accessed: No such file or directory
#9 2.736 Adding system user `uuidd' (UID 101) ...
#9 2.736 Adding new user `uuidd' (UID 101) with group `uuidd' ...
#9 2.963 Not creating home directory `/run/uuidd'.
#9 2.973 invoke-rc.d: could not determine current runlevel
#9 2.975 invoke-rc.d: policy-rc.d denied execution of start.
#4 extracting sha256:2f8d98df0991fd5b02a9f791cb766f66d83016b1b831e1b5e58438a8cb6de207 15.1s
#9 DONE 7.4s

#10 [cli-build 3/5] WORKDIR /go/src/github.com/docker/cli
#10 DONE 0.0s

#11 [cli-build 4/5] RUN git clone https://github.com/docker/cli . && git che...
#11 0.850 Cloning into '.'...
#4 extracting sha256:2f8d98df0991fd5b02a9f791cb766f66d83016b1b831e1b5e58438a8cb6de207 20.3s
#11 4.405 Note: checking out 'a1b83ffd2cbeefc0752e5aa7a543d49c1ddfd2cb'.
#11 4.405 
#11 4.405 You are in 'detached HEAD' state. You can look around, make experimental
#11 4.405 changes and commit them, and you can discard any commits you make in this
#11 4.405 state without impacting any branches by performing another checkout.
#11 4.405 
#11 4.405 If you want to create a new branch to retain commits you create, you may
#11 4.405 do so (now or later) by using -b with the checkout command again. Example:
#11 4.405 
#11 4.405   git checkout -b <new-branch-name>
#11 4.405 
#11 4.405 HEAD is now at a1b83ffd Merge pull request #1894 from thaJeztah/19.03_backport_reduce_vendoring_impact
#11 DONE 5.5s

#12 [cli-build 5/5] RUN make binary-osx binary-windows binary
#12 0.682 ./scripts/build/osx
#12 0.705 Building build/docker-darwin-amd64
#4 extracting sha256:2f8d98df0991fd5b02a9f791cb766f66d83016b1b831e1b5e58438a8cb6de207 25.4s
#4 extracting sha256:2f8d98df0991fd5b02a9f791cb766f66d83016b1b831e1b5e58438a8cb6de207 27.0s done
#4 DONE 66.1s

#5 [cli-build 2/5] RUN apt-get install -y -q --no-install-recommends   core...
#5 0.903 Reading package lists...
#5 1.661 Building dependency tree...
#5 1.810 Reading state information...
#5 1.974 coreutils is already the newest version (8.30-3).
#5 1.974 coreutils set to manually installed.
#5 1.974 util-linux is already the newest version (2.33.1-0.1).
#5 1.974 util-linux set to manually installed.
#5 1.974 The following NEW packages will be installed:
#5 1.974   uuid-runtime
#5 2.245 0 upgraded, 1 newly installed, 0 to remove and 1 not upgraded.
#5 2.245 Need to get 95.2 kB of archives.
#5 2.245 After this operation, 211 kB of additional disk space will be used.
#5 2.245 Get:1 http://deb.debian.org/debian buster/main amd64 uuid-runtime amd64 2.33.1-0.1 [95.2 kB]
#5 2.450 debconf: delaying package configuration, since apt-utils is not installed
#5 2.483 Fetched 95.2 kB in 0s (367 kB/s)
#5 2.526 Selecting previously unselected package uuid-runtime.
#5 2.526 (Reading database ... 
(Reading database ... 5%
(Reading database ... 10%
(Reading database ... 15%
(Reading database ... 20%
(Reading database ... 25%
(Reading database ... 30%
(Reading database ... 35%
(Reading database ... 40%
(Reading database ... 45%
(Reading database ... 50%
(Reading database ... 55%
(Reading database ... 60%
(Reading database ... 65%
(Reading database ... 70%
(Reading database ... 75%
(Reading database ... 80%
(Reading database ... 85%
(Reading database ... 90%
(Reading database ... 95%
(Reading database ... 100%
(Reading database ... 25419 files and directories currently installed.)
#5 2.544 Preparing to unpack .../uuid-runtime_2.33.1-0.1_amd64.deb ...
#5 2.554 Unpacking uuid-runtime (2.33.1-0.1) ...
#5 2.612 Setting up uuid-runtime (2.33.1-0.1) ...
#5 2.646 Adding group `uuidd' (GID 102) ...
#5 2.662 Done.
#5 2.698 Warning: The home dir /run/uuidd you specified can't be accessed: No such file or directory
#5 2.698 Adding system user `uuidd' (UID 101) ...
#5 2.698 Adding new user `uuidd' (UID 101) with group `uuidd' ...
#5 2.810 Not creating home directory `/run/uuidd'.
#5 2.818 invoke-rc.d: could not determine current runlevel
#5 2.820 invoke-rc.d: policy-rc.d denied execution of start.
#5 DONE 12.6s

#6 [cli-build 3/5] WORKDIR /go/src/github.com/docker/cli
#6 DONE 0.1s

#7 [cli-build 4/5] RUN git clone https://github.com/docker/cli . && git che...
#7 0.985 Cloning into '.'...
#7 6.936 Note: checking out 'a1b83ffd2cbeefc0752e5aa7a543d49c1ddfd2cb'.
#7 6.936 
#7 6.936 You are in 'detached HEAD' state. You can look around, make experimental
#7 6.936 changes and commit them, and you can discard any commits you make in this
#7 6.936 state without impacting any branches by performing another checkout.
#7 6.936 
#7 6.936 If you want to create a new branch to retain commits you create, you may
#7 6.936 do so (now or later) by using -b with the checkout command again. Example:
#7 6.936 
#7 6.936   git checkout -b <new-branch-name>
#7 6.936 
#7 6.936 HEAD is now at a1b83ffd Merge pull request #1894 from thaJeztah/19.03_backport_reduce_vendoring_impact
#7 DONE 7.6s

#8 [cli-build 5/5] RUN make binary-osx binary-windows binary
#8 1.037 ./scripts/build/osx
#8 1.089 Building build/docker-darwin-amd64
#12 88.21 ./scripts/build/windows
#12 88.23 Generating windows resources
#12 88.27 Building build/docker-windows-amd64
#12 DONE 100.9s

#13 [invocation 3/4] COPY --from=build /go/src/github.com/docker/app/bin/cna...
#13 DONE 0.6s

#14 [invocation 4/4] WORKDIR /cnab/app
#14 DONE 0.1s

#15 exporting to image
#15 exporting layers
#15 exporting layers 0.3s done
#15 writing image sha256:7634781bfea37209488ed911194e32d2221a7358723eebbbf79456dafe63c22a done
#15 naming to docker.io/docker/cnab-app-base:jenkins-app-PR-719-38 done
#15 DONE 0.3s
docker save docker/cnab-app-base:jenkins-app-PR-719-38 -o _build/invocation-image.tar
[Pipeline] sh
+ make -f docker.Makefile INVOCATION_IMAGE_TAG=jenkins-app-PR-719-38-coverage OUTPUT=coverage-invocation-image.tar save-invocation-image-tag
docker tag docker/cnab-app-base:jenkins-app-PR-719-38 docker/cnab-app-base:jenkins-app-PR-719-38-coverage
docker save docker/cnab-app-base:jenkins-app-PR-719-38-coverage -o _build/coverage-invocation-image.tar
[Pipeline] }
[Pipeline] // ansiColor
[Pipeline] dir
Running in /home/ubuntu/workspace/app_PR-719/src/github.com/docker/app/_build
[Pipeline] {
[Pipeline] stash
Stashed 1 file(s) to https://corp-us-east-1-jenkins-k8s-maste-jenkinsartifacts-1lzm7adht5e1j.s3.amazonaws.com/public/app/PR-719/38/stashes/invocation-image.tgz
[Pipeline] stash
Stashed 1 file(s) to https://corp-us-east-1-jenkins-k8s-maste-jenkinsartifacts-1lzm7adht5e1j.s3.amazonaws.com/public/app/PR-719/38/stashes/coverage-invocation-image.tgz
[Pipeline] }
[Pipeline] // dir
[Pipeline] }
[Pipeline] // dir
Post stage
[Pipeline] dir
Running in /home/ubuntu/workspace/app_PR-719/src/github.com/docker/app
[Pipeline] {
[Pipeline] sh
+ docker rmi docker/cnab-app-base:jenkins-app-PR-719-38
Untagged: docker/cnab-app-base:jenkins-app-PR-719-38
[Pipeline] sh
+ docker rmi docker/cnab-app-base:jenkins-app-PR-719-38-coverage
Untagged: docker/cnab-app-base:jenkins-app-PR-719-38-coverage
Deleted: sha256:7634781bfea37209488ed911194e32d2221a7358723eebbbf79456dafe63c22a
[Pipeline] }
[Pipeline] // dir
[Pipeline] deleteDir
[Pipeline] }
[Pipeline] // node
[Pipeline] }
[Pipeline] // stage
[Pipeline] }
#8 105.5 ./scripts/build/windows
#8 105.5 Generating windows resources
#8 105.5 Building build/docker-windows-amd64
#12 173.1 WARNING: binary creates a Linux executable. Use cross for macOS or Windows.
#12 173.1 ./scripts/build/binary
#12 173.1 Building statically linked build/docker-linux-amd64
#8 190.3 WARNING: binary creates a Linux executable. Use cross for macOS or Windows.
#8 190.3 ./scripts/build/binary
#8 190.3 Building statically linked build/docker-linux-amd64
#12 DONE 244.9s

#13 [dev 4/9] COPY --from=cli-build /go/src/github.com/docker/cli/build/dock...
#13 DONE 0.3s

#14 [dev 5/9] RUN curl -o /usr/bin/dep -L https://github.com/golang/dep/rele...
#14 0.917   % Total    % Received % Xferd  Average Speed   Time    Time     Time  Current
#14 0.917                                  Dload  Upload   Total   Spent    Left  Speed
#14 0.918 
  0     0    0     0    0     0      0      0 --:--:-- --:--:-- --:--:--     0
100   605    0   605    0     0   5127      0 --:--:-- --:--:-- --:--:--  5215
#14 1.056 
  0 10.5M    0     0    0     0      0      0 --:--:-- --:--:-- --:--:--     0
100 10.5M  100 10.5M    0     0  44.2M      0 --:--:-- --:--:-- --:--:--  107M
#14 DONE 1.4s

#15 [dev 6/9] RUN mkdir /go/src/gotest.tools &&   git clone -q https://githu...
#15 11.25 go: downloading gotest.tools v2.1.0+incompatible
#15 11.29 go: extracting gotest.tools v2.1.0+incompatible
#15 11.31 go: downloading github.com/spf13/pflag v1.0.1
#15 11.31 go: downloading github.com/sirupsen/logrus v1.0.5
#15 11.32 go: downloading github.com/jonboulle/clockwork v0.1.0
#15 11.32 go: downloading golang.org/x/sync v0.0.0-20180314180146-1d60e4601c6f
#15 11.32 go: downloading github.com/fatih/color v1.6.0
#15 11.32 go: downloading github.com/pkg/errors v0.8.0
#15 11.39 go: extracting github.com/sirupsen/logrus v1.0.5
#15 11.40 go: downloading golang.org/x/crypto v0.0.0-20180426230345-b49d69b5da94
#15 11.40 go: downloading golang.org/x/sys v0.0.0-20180909124046-d0be0721c37e
#15 11.40 go: extracting github.com/pkg/errors v0.8.0
#15 11.41 go: extracting golang.org/x/sync v0.0.0-20180314180146-1d60e4601c6f
#15 11.41 go: extracting github.com/jonboulle/clockwork v0.1.0
#15 11.43 go: downloading golang.org/x/net v0.0.0-20181102091132-c10e9556a7bc
#15 11.43 go: extracting github.com/spf13/pflag v1.0.1
#15 11.85 go: extracting github.com/fatih/color v1.6.0
#15 11.86 go: downloading github.com/mattn/go-colorable v0.0.9
#15 11.86 go: downloading github.com/mattn/go-isatty v0.0.3
#15 11.94 go: extracting github.com/mattn/go-isatty v0.0.3
#15 11.95 go: extracting github.com/mattn/go-colorable v0.0.9
#15 12.34 go: extracting golang.org/x/crypto v0.0.0-20180426230345-b49d69b5da94
#15 12.52 go: extracting golang.org/x/net v0.0.0-20181102091132-c10e9556a7bc
#15 12.63 go: extracting golang.org/x/sys v0.0.0-20180909124046-d0be0721c37e
#15 12.71 go: finding github.com/fatih/color v1.6.0
#15 12.71 go: finding github.com/pkg/errors v0.8.0
#15 12.72 go: finding github.com/sirupsen/logrus v1.0.5
#15 12.73 go: finding github.com/spf13/pflag v1.0.1
#15 12.73 go: finding github.com/mattn/go-colorable v0.0.9
#15 12.74 go: finding github.com/mattn/go-isatty v0.0.3
#15 12.76 go: finding golang.org/x/crypto v0.0.0-20180426230345-b49d69b5da94
#15 12.76 go: finding golang.org/x/sys v0.0.0-20180909124046-d0be0721c37e
#15 12.77 go: finding github.com/jonboulle/clockwork v0.1.0
#15 12.78 go: finding golang.org/x/sync v0.0.0-20180314180146-1d60e4601c6f
#15 12.79 go: finding golang.org/x/net v0.0.0-20181102091132-c10e9556a7bc
#15 DONE 35.0s

#16 [dev 7/9] RUN GOOS=linux   go build -o /usr/local/bin/test2json-linux   ...
#16 DONE 2.0s

#17 [dev 8/9] RUN go get -d gopkg.in/mjibson/esc.v0 &&   cd /go/src/github.c...
#17 7.284 golang.org/x/tools/internal/semver
#17 7.325 github.com/pkg/errors
#17 7.335 golang.org/x/tools/go/ast/astutil
#17 7.390 golang.org/x/tools/go/internal/gcimporter
#17 7.666 golang.org/x/tools/go/internal/packagesdriver
#17 7.736 golang.org/x/tools/internal/fastwalk
#17 7.793 golang.org/x/tools/internal/gopathwalk
#17 7.857 golang.org/x/tools/internal/span
#17 8.026 golang.org/x/tools/internal/module
#17 8.115 golang.org/x/tools/go/gcexportdata
#17 8.141 golang.org/x/tools/go/packages
#17 8.371 golang.org/x/tools/internal/imports
#17 8.765 golang.org/x/tools/imports
#17 8.778 github.com/mjibson/esc/embed
#17 8.820 github.com/mjibson/esc
#17 DONE 10.1s

#19 [dev 9/9] COPY . .
#19 DONE 3.3s

#20 exporting to image
#20 exporting layers
#20 exporting layers 2.0s done
#20 writing image sha256:65f584e9d611e860899e945de3a1df40872d9596d0f81f4c9d776b5a2814e50b done
#20 naming to docker.io/library/docker-app-dev:jenkins-app-PR-719-38 done
#20 DONE 2.0s
Check Vendoring...
docker run --rm docker-app-dev:jenkins-app-PR-719-38 sh -c "make vendor && hack/check-git-diff vendor"
rm -rf vendor 1>&1
dep ensure -v 
#8 DONE 262.4s

#9 [cli 1/3] COPY --from=cli-build /go/src/github.com/docker/cli/build/dock...
#9 DONE 0.3s

#10 [cli 2/3] COPY --from=cli-build /go/src/github.com/docker/cli/build/dock...
#10 DONE 0.2s

#11 [cli 3/3] COPY --from=cli-build /go/src/github.com/docker/cli/build/dock...
#11 DONE 0.2s

#12 exporting to client
#12 copying files 14.39MB 0.1s
#12 copying files 181.89MB 1.1s done
#12 DONE 1.5s
docker build --build-arg TAG=jenkins-app-PR-719-38 --build-arg COMMIT=493501a1 --build-arg ALPINE_VERSION=3.10.3 --build-arg GOPROXY=direct --output type=local,dest=./bin/ --target=cross -t docker-app-cross:jenkins-app-PR-719-38 .
#2 [internal] load build definition from Dockerfile
#2 transferring dockerfile: 38B done
#2 DONE 0.0s

#1 [internal] load .dockerignore
#1 transferring context: 34B done
#1 DONE 0.0s

#4 [internal] load metadata for docker.io/dockercore/golang-cross:1.12.9@sh...
#4 DONE 0.0s

#3 [internal] load metadata for docker.io/library/golang:1.13.3
#3 DONE 5.3s

#8 [cli-build 1/5] FROM docker.io/dockercore/golang-cross:1.12.9@sha256:3ea...
#8 DONE 0.0s

#9 [cli-build 2/5] RUN apt-get install -y -q --no-install-recommends   core...
#9 CACHED

#10 [cli-build 3/5] WORKDIR /go/src/github.com/docker/cli
#10 CACHED

#11 [cli-build 4/5] RUN git clone https://github.com/docker/cli . && git che...
#11 CACHED

#12 [cli-build 5/5] RUN make binary-osx binary-windows binary
#12 CACHED

#5 [dev 1/9] FROM docker.io/library/golang:1.13.3@sha256:6a693fbaba7dd8d816...
#5 resolve docker.io/library/golang:1.13.3@sha256:6a693fbaba7dd8d816f6afce049fb92b280c588e0a677c4c8db26645e613fc15 done
#5 sha256:3d607e3e3a9dd7d1094b634e6d1f69ae65f5d9a2193d3b3b9fd46b780bd221fe 1.79kB / 1.79kB done
#5 sha256:dc7582e06f8e0a61b450f02b8ab83484acc6b437a75b4e9959f11a964aea1169 5.46kB / 5.46kB done
#5 sha256:c7b7d16361e00faca0e9393f3f43923f25ceb1210face87839dfc5de988905c1 10.50MB / 50.38MB 0.2s
#5 sha256:6a693fbaba7dd8d816f6afce049fb92b280c588e0a677c4c8db26645e613fc15 2.16kB / 2.16kB done
#5 sha256:b7a128769df1909f91b589d0a4a2e1c1671aebc047a9f46b4b30dfeb7308ea6a 7.81MB / 7.81MB 0.1s done
#5 sha256:1128949d0793d2435bb1f0640a777f32feee88b71d4fe234121c3cfb345a80c4 5.24MB / 10.00MB 0.2s
#5 sha256:667692510b7038b74e221f92eb33610e4968b669c8a718378ecb1f78739c3713 0B / 51.77MB 0.2s
#5 sha256:c7b7d16361e00faca0e9393f3f43923f25ceb1210face87839dfc5de988905c1 16.26MB / 50.38MB 0.3s
#5 sha256:1128949d0793d2435bb1f0640a777f32feee88b71d4fe234121c3cfb345a80c4 10.00MB / 10.00MB 0.3s
#5 sha256:667692510b7038b74e221f92eb33610e4968b669c8a718378ecb1f78739c3713 6.77MB / 51.77MB 0.3s
#5 sha256:c7b7d16361e00faca0e9393f3f43923f25ceb1210face87839dfc5de988905c1 26.07MB / 50.38MB 0.4s
#5 sha256:1128949d0793d2435bb1f0640a777f32feee88b71d4fe234121c3cfb345a80c4 10.00MB / 10.00MB 0.3s done
#5 sha256:667692510b7038b74e221f92eb33610e4968b669c8a718378ecb1f78739c3713 10.15MB / 51.77MB 0.4s
#5 sha256:c70d80036479d598a6173d377ad1e726df898511a98ba73896f3798635e41f62 0B / 68.52MB 0.4s
#5 sha256:c7b7d16361e00faca0e9393f3f43923f25ceb1210face87839dfc5de988905c1 39.97MB / 50.38MB 0.6s
#5 sha256:667692510b7038b74e221f92eb33610e4968b669c8a718378ecb1f78739c3713 25.80MB / 51.77MB 0.6s
#5 sha256:c70d80036479d598a6173d377ad1e726df898511a98ba73896f3798635e41f62 6.23MB / 68.52MB 0.6s
#5 sha256:c7b7d16361e00faca0e9393f3f43923f25ceb1210face87839dfc5de988905c1 43.26MB / 50.38MB 0.7s
#5 sha256:667692510b7038b74e221f92eb33610e4968b669c8a718378ecb1f78739c3713 28.41MB / 51.77MB 0.7s
#5 sha256:c70d80036479d598a6173d377ad1e726df898511a98ba73896f3798635e41f62 11.21MB / 68.52MB 0.7s
#5 sha256:c7b7d16361e00faca0e9393f3f43923f25ceb1210face87839dfc5de988905c1 48.55MB / 50.38MB 0.8s
#5 sha256:667692510b7038b74e221f92eb33610e4968b669c8a718378ecb1f78739c3713 37.51MB / 51.77MB 0.8s
#5 sha256:c70d80036479d598a6173d377ad1e726df898511a98ba73896f3798635e41f62 15.27MB / 68.52MB 0.8s
#5 sha256:c7b7d16361e00faca0e9393f3f43923f25ceb1210face87839dfc5de988905c1 50.38MB / 50.38MB 0.9s done
#5 sha256:667692510b7038b74e221f92eb33610e4968b669c8a718378ecb1f78739c3713 51.77MB / 51.77MB 1.0s
#5 sha256:c70d80036479d598a6173d377ad1e726df898511a98ba73896f3798635e41f62 23.94MB / 68.52MB 1.0s
#5 sha256:f332e1ccc3d895f13e9660c053e8bda16c4894c5179526cf7702ad014cd5fa88 0B / 120.06MB 1.0s
#5 sha256:667692510b7038b74e221f92eb33610e4968b669c8a718378ecb1f78739c3713 51.77MB / 51.77MB 1.1s done
#5 sha256:c70d80036479d598a6173d377ad1e726df898511a98ba73896f3798635e41f62 36.00MB / 68.52MB 1.2s
#5 extracting sha256:c7b7d16361e00faca0e9393f3f43923f25ceb1210face87839dfc5de988905c1
#5 sha256:07e0a3e016334dc43ddfb498264511edf2341c6a4c9ceea921f6100e70bae220 125B / 125B 1.1s done
#5 sha256:c70d80036479d598a6173d377ad1e726df898511a98ba73896f3798635e41f62 45.16MB / 68.52MB 1.3s
#5 sha256:f332e1ccc3d895f13e9660c053e8bda16c4894c5179526cf7702ad014cd5fa88 10.91MB / 120.06MB 1.3s
#5 sha256:c70d80036479d598a6173d377ad1e726df898511a98ba73896f3798635e41f62 53.10MB / 68.52MB 1.4s
#5 sha256:f332e1ccc3d895f13e9660c053e8bda16c4894c5179526cf7702ad014cd5fa88 17.77MB / 120.06MB 1.4s
#5 sha256:c70d80036479d598a6173d377ad1e726df898511a98ba73896f3798635e41f62 59.45MB / 68.52MB 1.5s
#5 sha256:c70d80036479d598a6173d377ad1e726df898511a98ba73896f3798635e41f62 63.23MB / 68.52MB 1.6s
#5 sha256:f332e1ccc3d895f13e9660c053e8bda16c4894c5179526cf7702ad014cd5fa88 26.58MB / 120.06MB 1.6s
#5 sha256:c70d80036479d598a6173d377ad1e726df898511a98ba73896f3798635e41f62 68.52MB / 68.52MB 1.8s
#5 sha256:f332e1ccc3d895f13e9660c053e8bda16c4894c5179526cf7702ad014cd5fa88 38.31MB / 120.06MB 1.8s
#5 sha256:c70d80036479d598a6173d377ad1e726df898511a98ba73896f3798635e41f62 68.52MB / 68.52MB 1.8s done
#5 sha256:f332e1ccc3d895f13e9660c053e8bda16c4894c5179526cf7702ad014cd5fa88 47.80MB / 120.06MB 1.9s
#5 sha256:f332e1ccc3d895f13e9660c053e8bda16c4894c5179526cf7702ad014cd5fa88 55.53MB / 120.06MB 2.0s
#5 sha256:f332e1ccc3d895f13e9660c053e8bda16c4894c5179526cf7702ad014cd5fa88 70.98MB / 120.06MB 2.2s
#5 sha256:f332e1ccc3d895f13e9660c053e8bda16c4894c5179526cf7702ad014cd5fa88 83.34MB / 120.06MB 2.4s
#5 sha256:f332e1ccc3d895f13e9660c053e8bda16c4894c5179526cf7702ad014cd5fa88 97.10MB / 120.06MB 2.6s
#5 sha256:f332e1ccc3d895f13e9660c053e8bda16c4894c5179526cf7702ad014cd5fa88 113.29MB / 120.06MB 2.8s
#5 sha256:f332e1ccc3d895f13e9660c053e8bda16c4894c5179526cf7702ad014cd5fa88 120.06MB / 120.06MB 2.9s
#5 sha256:f332e1ccc3d895f13e9660c053e8bda16c4894c5179526cf7702ad014cd5fa88 120.06MB / 120.06MB 3.0s done
#5 ...

#18 [internal] load build context
#18 transferring context: 73.02MB 3.5s done
#18 DONE 3.5s

#5 [dev 1/9] FROM docker.io/library/golang:1.13.3@sha256:6a693fbaba7dd8d816...
#5 extracting sha256:c7b7d16361e00faca0e9393f3f43923f25ceb1210face87839dfc5de988905c1 3.7s done
#5 extracting sha256:b7a128769df1909f91b589d0a4a2e1c1671aebc047a9f46b4b30dfeb7308ea6a
#5 extracting sha256:b7a128769df1909f91b589d0a4a2e1c1671aebc047a9f46b4b30dfeb7308ea6a 0.3s done
#5 extracting sha256:1128949d0793d2435bb1f0640a777f32feee88b71d4fe234121c3cfb345a80c4
(1/102) Wrote github.com/docker/go@v1.5.1-1
#5 extracting sha256:1128949d0793d2435bb1f0640a777f32feee88b71d4fe234121c3cfb345a80c4 0.3s done
#5 extracting sha256:667692510b7038b74e221f92eb33610e4968b669c8a718378ecb1f78739c3713
(2/102) Wrote github.com/docker/go-metrics@d466d4f6fd960e01820085bd7e1a24426ee7ef18
(3/102) Wrote github.com/gogo/googleapis@v1.2.0
(4/102) Wrote github.com/docker/go-connections@v0.4.0
#5 extracting sha256:667692510b7038b74e221f92eb33610e4968b669c8a718378ecb1f78739c3713 2.0s done
#5 extracting sha256:c70d80036479d598a6173d377ad1e726df898511a98ba73896f3798635e41f62
(5/102) Wrote github.com/docker/docker-credential-helpers@v0.6.1
(6/102) Wrote github.com/docker/go-units@v0.3.3
(7/102) Wrote github.com/docker/go-events@master
(8/102) Wrote github.com/gofrs/flock@v0.7.1
#5 extracting sha256:c70d80036479d598a6173d377ad1e726df898511a98ba73896f3798635e41f62 2.1s done
#5 extracting sha256:f332e1ccc3d895f13e9660c053e8bda16c4894c5179526cf7702ad014cd5fa88
(9/102) Wrote vbom.ml/util@master
(10/102) Wrote github.com/globalsign/mgo@master
(11/102) Wrote github.com/google/go-cmp@v0.2.0
(12/102) Wrote github.com/google/gofuzz@v1.0.0
(13/102) Wrote github.com/google/shlex@master
(14/102) Wrote github.com/gorilla/mux@v1.7.1
#5 extracting sha256:f332e1ccc3d895f13e9660c053e8bda16c4894c5179526cf7702ad014cd5fa88 4.2s done
(15/102) Wrote github.com/grpc-ecosystem/grpc-opentracing@master
#5 extracting sha256:07e0a3e016334dc43ddfb498264511edf2341c6a4c9ceea921f6100e70bae220 done
#5 DONE 14.7s

#6 [dev 2/9] RUN apt-get update && apt-get install -y -q --no-install-recom...
(16/102) Wrote github.com/hashicorp/go-version@v1.1.0
(17/102) Wrote github.com/docker/cnab-to-oci@v0.3.0-beta1
(18/102) Wrote github.com/hashicorp/golang-lru@v0.5.1
#6 0.899 Get:1 http://security.debian.org/debian-security buster/updates InRelease [39.1 kB]
#6 0.991 Get:2 http://security.debian.org/debian-security buster/updates/main amd64 Packages [113 kB]
#6 1.010 Get:3 http://deb.debian.org/debian buster InRelease [122 kB]
#6 1.015 Get:4 http://deb.debian.org/debian buster-updates InRelease [49.3 kB]
#6 1.115 Get:5 http://deb.debian.org/debian buster/main amd64 Packages [7899 kB]
#6 1.240 Get:6 http://deb.debian.org/debian buster-updates/main amd64 Packages [5792 B]
(19/102) Wrote github.com/imdario/mergo@master
(20/102) Wrote github.com/inconshreveable/mousetrap@v1.0
(21/102) Wrote github.com/jackpal/gateway (from github.com/ndeloof/gateway)@10816db7ab2f4b71e71dba9420bfa67d5be27b33
(22/102) Wrote github.com/jaguilar/vt100 (from github.com/tonistiigi/vt100)@ad4c4a5743050fb7f88ce968dca9422f72a0e3f2
#6 2.449 Fetched 8227 kB in 2s (4568 kB/s)
#6 2.449 Reading package lists...(23/102) Wrote github.com/googleapis/gnostic@v0.2.0

#6 3.078 Reading package lists...(24/102) Wrote github.com/konsorten/go-windows-terminal-sequences@v1.0.2

#6 3.689 Building dependency tree...
#6 3.801 Reading state information...
#6 3.940 coreutils is already the newest version (8.30-3).
#6 3.940 coreutils set to manually installed.
#6 3.940 util-linux is already the newest version (2.33.1-0.1).
#6 3.940 util-linux set to manually installed.
#6 3.940 The following NEW packages will be installed:
(25/102) Wrote github.com/mattn/go-shellwords@v1.0.5
#6 3.940   uuid-runtime
(26/102) Wrote github.com/json-iterator/go@v1.1.6
(27/102) Wrote github.com/matttproud/golang_protobuf_extensions@v1.0.1
#6 4.316 0 upgraded, 1 newly installed, 0 to remove and 0 not upgraded.
#6 4.316 Need to get 95.2 kB of archives.
#6 4.316 After this operation, 211 kB of additional disk space will be used.
#6 4.316 Get:1 http://deb.debian.org/debian buster/main amd64 uuid-runtime amd64 2.33.1-0.1 [95.2 kB]
#6 4.427 debconf: delaying package configuration, since apt-utils is not installed
#6 4.450 Fetched 95.2 kB in 0s (259 kB/s)
#6 4.474 Selecting previously unselected package uuid-runtime.
#6 4.474 (Reading database ... 
(Reading database ... 5%
(Reading database ... 10%
(Reading database ... 15%
(Reading database ... 20%
(Reading database ... 25%
(Reading database ... 30%
(Reading database ... 35%
(Reading database ... 40%
(Reading database ... 45%
(Reading database ... 50%
(Reading database ... 55%
(Reading database ... 60%
(Reading database ... 65%
(Reading database ... 70%
(Reading database ... 75%
(Reading database ... 80%
(Reading database ... 85%
(Reading database ... 90%
(Reading database ... 95%
(Reading database ... 100%
(Reading database ... 15394 files and directories currently installed.)
#6 4.483 Preparing to unpack .../uuid-runtime_2.33.1-0.1_amd64.deb ...
#6 4.487 Unpacking uuid-runtime (2.33.1-0.1) ...
#6 4.527 Setting up uuid-runtime (2.33.1-0.1) ...
#6 4.562 Adding group `uuidd' (GID 102) ...
#6 4.580 Done.
#6 4.606 Warning: The home dir /run/uuidd you specified can't be accessed: No such file or directory
#6 4.606 Adding system user `uuidd' (UID 101) ...
#6 4.607 Adding new user `uuidd' (UID 101) with group `uuidd' ...
#6 4.649 Not creating home directory `/run/uuidd'.
#6 4.658 invoke-rc.d: could not determine current runlevel
#6 4.660 invoke-rc.d: policy-rc.d denied execution of start.
(28/102) Wrote github.com/docker/distribution@0d3efadf0154c2b8a4e7b6621fff9809655cc580
(29/102) Wrote github.com/miekg/pkcs11@master
(30/102) Wrote github.com/mitchellh/mapstructure@v1.1.2
#6 DONE 5.8s

#7 [dev 3/9] WORKDIR /go/src/github.com/docker/app/
#7 DONE 0.0s

#13 [dev 4/9] COPY --from=cli-build /go/src/github.com/docker/cli/build/dock...
#13 DONE 0.3s
(31/102) Wrote github.com/docker/compose-on-kubernetes@v0.4.21

#14 [dev 5/9] RUN curl -o /usr/bin/dep -L https://github.com/golang/dep/rele...
(32/102) Wrote github.com/modern-go/concurrent@1.0.3
#14 0.623   % Total    % Received % Xferd  Average Speed   Time    Time     Time  Current
#14 0.626                                  Dload  Upload   Total   Spent    Left  Speed
#14 0.628 
  0     0    0     0    0     0      0      0 --:--:-- --:--:-- --:--:--     0
100   605    0   605    0     0   3878      0 --:--:-- --:--:-- --:--:--  3878
#14 0.897 
100 10.5M  100 10.5M    0     0  38.5M      0 --:--:-- --:--:-- --:--:-- 38.5M
(33/102) Wrote github.com/modern-go/reflect2@1.0.1
#14 DONE 1.0s

#15 [dev 6/9] RUN mkdir /go/src/gotest.tools &&   git clone -q https://githu...
(34/102) Wrote github.com/morikuni/aec@master
(35/102) Wrote github.com/oklog/ulid@v1.3.1
(36/102) Wrote github.com/opencontainers/go-digest@v1.0.0-rc1
(37/102) Wrote github.com/golang/protobuf@v1.3.1
(38/102) Wrote github.com/opencontainers/image-spec@v1.0.1
(39/102) Wrote github.com/opentracing/opentracing-go@v1.1.0
(40/102) Wrote github.com/pkg/errors@v0.8.1
(41/102) Wrote github.com/opencontainers/runtime-spec@29686dbc5559d93fb1ef402eeda3e35c38d75af4
(42/102) Wrote github.com/prometheus/client_model@master
(43/102) Wrote github.com/docker/swarmkit@18e7e58ea1a5ec016625a636d0d52500eea123bc
(44/102) Wrote github.com/prometheus/client_golang@v0.8.0
(45/102) Wrote github.com/qri-io/jsonpointer@v0.1.0
(46/102) Wrote github.com/prometheus/procfs@master
(47/102) Wrote github.com/prometheus/common@v0.2.0
(48/102) Wrote github.com/qri-io/jsonschema@v0.1.1
(49/102) Wrote github.com/sirupsen/logrus@v1.4.1
(50/102) Wrote github.com/spf13/cobra@v0.0.5
(51/102) Wrote github.com/spf13/pflag@master
(52/102) Wrote github.com/docker/cli@d83cd90464377d4164c8f70248d064b979e5ca98
(53/102) Wrote github.com/opencontainers/runc@v1.0.0-rc7
(54/102) Wrote github.com/syndtr/gocapability@master
(55/102) Wrote github.com/tonistiigi/units@master
(56/102) Wrote github.com/moby/buildkit@v0.6.2
(57/102) Wrote github.com/wadey/gocovmerge@master
(58/102) Wrote github.com/xeipuuv/gojsonreference@master
(59/102) Wrote github.com/tonistiigi/fsutil@master
(60/102) Wrote github.com/xeipuuv/gojsonpointer@master
(61/102) Wrote github.com/xeipuuv/gojsonschema@93e72a773fade158921402d6a24c819b48aba29d
#15 11.25 go: downloading gotest.tools v2.1.0+incompatible
#15 11.29 go: extracting gotest.tools v2.1.0+incompatible
#15 11.30 go: downloading github.com/spf13/pflag v1.0.1
#15 11.30 go: downloading github.com/fatih/color v1.6.0
#15 11.31 go: downloading github.com/sirupsen/logrus v1.0.5
#15 11.31 go: downloading github.com/pkg/errors v0.8.0
#15 11.32 go: downloading golang.org/x/sync v0.0.0-20180314180146-1d60e4601c6f
#15 11.32 go: downloading github.com/jonboulle/clockwork v0.1.0
#15 11.37 go: extracting github.com/sirupsen/logrus v1.0.5
#15 11.37 go: downloading golang.org/x/sys v0.0.0-20180909124046-d0be0721c37e
#15 11.37 go: extracting golang.org/x/sync v0.0.0-20180314180146-1d60e4601c6f
#15 11.38 go: downloading golang.org/x/crypto v0.0.0-20180426230345-b49d69b5da94
#15 11.40 go: downloading golang.org/x/net v0.0.0-20181102091132-c10e9556a7bc
#15 11.41 go: extracting github.com/jonboulle/clockwork v0.1.0
#15 11.41 go: extracting github.com/pkg/errors v0.8.0
#15 11.43 go: extracting github.com/spf13/pflag v1.0.1
#15 11.88 go: extracting github.com/fatih/color v1.6.0
#15 11.88 go: downloading github.com/mattn/go-colorable v0.0.9
#15 11.89 go: downloading github.com/mattn/go-isatty v0.0.3
#15 11.94 go: extracting github.com/mattn/go-colorable v0.0.9
#15 11.99 go: extracting github.com/mattn/go-isatty v0.0.3
(62/102) Wrote golang.org/x/sync@master
#15 12.42 go: extracting golang.org/x/crypto v0.0.0-20180426230345-b49d69b5da94
#15 12.53 go: extracting golang.org/x/net v0.0.0-20181102091132-c10e9556a7bc
#15 12.64 go: extracting golang.org/x/sys v0.0.0-20180909124046-d0be0721c37e
#15 12.72 go: finding github.com/fatih/color v1.6.0
#15 12.72 go: finding github.com/pkg/errors v0.8.0
#15 12.73 go: finding github.com/sirupsen/logrus v1.0.5
#15 12.73 go: finding github.com/spf13/pflag v1.0.1
#15 12.74 go: finding github.com/mattn/go-colorable v0.0.9
#15 12.75 go: finding github.com/mattn/go-isatty v0.0.3
#15 12.76 go: finding golang.org/x/crypto v0.0.0-20180426230345-b49d69b5da94
#15 12.77 go: finding golang.org/x/sys v0.0.0-20180909124046-d0be0721c37e
#15 12.78 go: finding github.com/jonboulle/clockwork v0.1.0
#15 12.78 go: finding golang.org/x/sync v0.0.0-20180314180146-1d60e4601c6f
#15 12.79 go: finding golang.org/x/net v0.0.0-20181102091132-c10e9556a7bc
(63/102) Wrote golang.org/x/crypto@master
(64/102) Wrote golang.org/x/oauth2@master
(65/102) Wrote golang.org/x/time@master
(66/102) Wrote gopkg.in/inf.v0@v0.9.1
(67/102) Wrote google.golang.org/appengine@v1.5.0
(68/102) Wrote golang.org/x/net@master
(69/102) Wrote gopkg.in/yaml.v2@v2.2.3
(70/102) Wrote gotest.tools@v2.3.0
(71/102) Wrote k8s.io/klog@v0.2.0
(72/102) Wrote k8s.io/utils@master
(73/102) Wrote k8s.io/apimachinery@kubernetes-1.14.1
(74/102) Wrote sigs.k8s.io/yaml@v1.1.0
(75/102) Wrote github.com/Azure/go-ansiterm@master
(76/102) Wrote golang.org/x/sys@master
(77/102) Wrote github.com/theupdateframework/notary@v0.6.1
(78/102) Wrote google.golang.org/grpc@v1.19.1
(79/102) Wrote github.com/Masterminds/semver@v1.4.2
(80/102) Wrote github.com/Microsoft/go-winio@v0.4.12
(81/102) Wrote github.com/agl/ed25519@master
(82/102) Wrote github.com/beorn7/perks@master
(83/102) Wrote github.com/containerd/console@master
(84/102) Wrote github.com/containerd/typeurl@master
(85/102) Wrote github.com/containerd/fifo@master
(86/102) Wrote golang.org/x/text@v0.3.0
(87/102) Wrote github.com/containerd/ttrpc@master
(88/102) Wrote github.com/davecgh/go-spew@v1.1.1
#15 DONE 34.8s

#16 [dev 7/9] RUN GOOS=linux   go build -o /usr/local/bin/test2json-linux   ...
(89/102) Wrote github.com/containerd/continuity@master
#16 DONE 2.0s

#17 [dev 8/9] RUN go get -d gopkg.in/mjibson/esc.v0 &&   cd /go/src/github.c...
(90/102) Wrote github.com/Microsoft/hcsshim@v0.8.6
(91/102) Wrote golang.org/x/tools@master
(92/102) Wrote github.com/deislabs/cnab-go@v0.7.1-beta1
(93/102) Wrote k8s.io/client-go@kubernetes-1.14.1
#17 7.393 golang.org/x/tools/internal/semver
#17 7.417 github.com/pkg/errors
#17 7.449 golang.org/x/tools/go/ast/astutil
#17 7.480 golang.org/x/tools/go/internal/gcimporter
#17 7.787 golang.org/x/tools/go/internal/packagesdriver
#17 7.885 golang.org/x/tools/internal/fastwalk
#17 7.963 golang.org/x/tools/internal/gopathwalk
#17 8.041 golang.org/x/tools/internal/span
#17 8.123 golang.org/x/tools/go/gcexportdata
#17 8.169 golang.org/x/tools/internal/module
#17 8.197 golang.org/x/tools/go/packages
(94/102) Wrote github.com/docker/buildx@v0.3.1
#17 8.453 golang.org/x/tools/internal/imports
#17 8.862 golang.org/x/tools/imports
#17 8.874 github.com/mjibson/esc/embed
#17 8.914 github.com/mjibson/esc
(95/102) Wrote google.golang.org/genproto@master
#17 DONE 9.9s

#19 [dev 9/9] COPY . .
(96/102) Wrote github.com/gogo/protobuf@v1.2.1
#19 DONE 0.7s

#20 [cross-build 1/1] RUN make TAG=jenkins-app-PR-719-38 cross
(97/102) Wrote cloud.google.com/go@v0.37.4
#20 0.864 GOOS=linux CGO_ENABLED=0 go build -tags= -ldflags="-s -w -X github.com/docker/app/internal.GitCommit=493501a1 -X github.com/docker/app/internal.Version=jenkins-app-PR-719-38 -X github.com/docker/app/internal.BuildTime=2019-11-08T07:45:43Z" -o bin/docker-app-linux ./cmd/docker-app
(98/102) Wrote github.com/containerd/containerd@v1.3.0
(99/102) Wrote github.com/coreos/etcd@v3.3.12
(100/102) Wrote k8s.io/api@kubernetes-1.14.1
(101/102) Wrote github.com/docker/docker@master
#20 54.49 GOOS=darwin CGO_ENABLED=0 go build -tags= -ldflags="-s -w -X github.com/docker/app/internal.GitCommit=493501a1 -X github.com/docker/app/internal.Version=jenkins-app-PR-719-38 -X github.com/docker/app/internal.BuildTime=2019-11-08T07:45:43Z" -o bin/docker-app-darwin ./cmd/docker-app
(102/102) Wrote k8s.io/kubernetes@v1.14.1
vendor is correct
[Pipeline] }
[Pipeline] // ansiColor
[Pipeline] }
[Pipeline] // dir
Post stage
[Pipeline] deleteDir
[Pipeline] }
[Pipeline] // node
[Pipeline] }
[Pipeline] // stage
[Pipeline] }
#20 111.2 GOOS=windows CGO_ENABLED=0 go build -tags= -ldflags="-s -w -X github.com/docker/app/internal.GitCommit=493501a1 -X github.com/docker/app/internal.Version=jenkins-app-PR-719-38 -X github.com/docker/app/internal.BuildTime=2019-11-08T07:45:43Z" -o bin/docker-app-windows.exe ./cmd/docker-app
#20 DONE 168.6s

#21 [cross 1/3] COPY --from=cross-build /go/src/github.com/docker/app/bin/do...
#21 DONE 0.1s

#22 [cross 2/3] COPY --from=cross-build /go/src/github.com/docker/app/bin/do...
#22 DONE 0.2s

#23 [cross 3/3] COPY --from=cross-build /go/src/github.com/docker/app/bin/do...
#23 DONE 0.2s

#24 exporting to client
#24 copying files 39B
#24 copying files 124.04MB 0.8s done
#24 DONE 1.0s
docker build --build-arg TAG=jenkins-app-PR-719-38 --build-arg COMMIT=493501a1 --build-arg ALPINE_VERSION=3.10.3 --build-arg GOPROXY=direct --output type=local,dest=./bin/ --target=e2e-cross -t docker-app-e2e-cross:jenkins-app-PR-719-38  .
#2 [internal] load .dockerignore
#2 transferring context: 34B done
#2 DONE 0.0s

#1 [internal] load build definition from Dockerfile
#1 transferring dockerfile: 38B done
#1 DONE 0.0s

#4 [internal] load metadata for docker.io/dockercore/golang-cross:1.12.9@sh...
#4 DONE 0.0s

#3 [internal] load metadata for docker.io/library/golang:1.13.3
#3 DONE 0.1s

#8 [cli-build 1/5] FROM docker.io/dockercore/golang-cross:1.12.9@sha256:3ea...
#8 DONE 0.0s

#5 [dev 1/9] FROM docker.io/library/golang:1.13.3@sha256:6a693fbaba7dd8d816...
#5 DONE 0.0s

#18 [internal] load build context
#18 transferring context: 341.04kB 0.2s done
#18 DONE 0.2s

#13 [dev 4/9] COPY --from=cli-build /go/src/github.com/docker/cli/build/dock...
#13 CACHED

#12 [cli-build 5/5] RUN make binary-osx binary-windows binary
#12 CACHED

#17 [dev 8/9] RUN go get -d gopkg.in/mjibson/esc.v0 &&   cd /go/src/github.c...
#17 CACHED

#19 [dev 9/9] COPY . .
#19 CACHED

#10 [cli-build 3/5] WORKDIR /go/src/github.com/docker/cli
#10 CACHED

#14 [dev 5/9] RUN curl -o /usr/bin/dep -L https://github.com/golang/dep/rele...
#14 CACHED

#15 [dev 6/9] RUN mkdir /go/src/gotest.tools &&   git clone -q https://githu...
#15 CACHED

#6 [dev 2/9] RUN apt-get update && apt-get install -y -q --no-install-recom...
#6 CACHED

#7 [dev 3/9] WORKDIR /go/src/github.com/docker/app/
#7 CACHED

#16 [dev 7/9] RUN GOOS=linux   go build -o /usr/local/bin/test2json-linux   ...
#16 CACHED

#9 [cli-build 2/5] RUN apt-get install -y -q --no-install-recommends   core...
#9 CACHED

#11 [cli-build 4/5] RUN git clone https://github.com/docker/cli . && git che...
#11 CACHED

#20 [cross-build 1/1] RUN make TAG=jenkins-app-PR-719-38 cross
#20 CACHED

#21 [e2e-cross-build 1/1] RUN make TAG=jenkins-app-PR-719-38 e2e-cross
#21 0.663 GOOS=linux CGO_ENABLED=0 go build -tags= -ldflags="-s -w -X github.com/docker/app/internal.GitCommit=493501a1 -X github.com/docker/app/internal.Version=jenkins-app-PR-719-38 -X github.com/docker/app/internal.BuildTime=2019-11-08T07:48:34Z" -o bin/docker-app-linux ./cmd/docker-app
#21 4.014 GOOS=linux CGO_ENABLED=0 go test -tags= -ldflags="-s -w -X github.com/docker/app/internal.GitCommit=493501a1 -X github.com/docker/app/internal.Version=jenkins-app-PR-719-38 -X github.com/docker/app/internal.BuildTime=2019-11-08T07:48:34Z" -c -o bin/docker-app-e2e-linux ./e2e/
#21 24.95 GOOS=darwin CGO_ENABLED=0 go build -tags= -ldflags="-s -w -X github.com/docker/app/internal.GitCommit=493501a1 -X github.com/docker/app/internal.Version=jenkins-app-PR-719-38 -X github.com/docker/app/internal.BuildTime=2019-11-08T07:48:34Z" -o bin/docker-app-darwin ./cmd/docker-app
#21 28.59 GOOS=darwin CGO_ENABLED=0 go test -tags= -ldflags="-s -w -X github.com/docker/app/internal.GitCommit=493501a1 -X github.com/docker/app/internal.Version=jenkins-app-PR-719-38 -X github.com/docker/app/internal.BuildTime=2019-11-08T07:48:34Z" -c -o bin/docker-app-e2e-darwin ./e2e/
#21 50.08 GOOS=windows CGO_ENABLED=0 go test -tags= -ldflags="-s -w -X github.com/docker/app/internal.GitCommit=493501a1 -X github.com/docker/app/internal.Version=jenkins-app-PR-719-38 -X github.com/docker/app/internal.BuildTime=2019-11-08T07:48:34Z" -c -o bin/docker-app-e2e-windows.exe ./e2e/
#21 DONE 72.1s

#22 [e2e-cross 1/9] COPY --from=e2e-cross-build /go/src/github.com/docker/ap...
#22 DONE 0.1s

#23 [e2e-cross 2/9] COPY --from=e2e-cross-build /go/src/github.com/docker/ap...
#23 DONE 0.3s

#24 [e2e-cross 3/9] COPY --from=e2e-cross-build /go/src/github.com/docker/ap...
#24 DONE 0.2s

#25 [e2e-cross 4/9] COPY --from=e2e-cross-build /usr/local/bin/gotestsum-lin...
#25 DONE 0.1s

#26 [e2e-cross 5/9] COPY --from=e2e-cross-build /usr/local/bin/gotestsum-dar...
#26 DONE 0.1s

#27 [e2e-cross 6/9] COPY --from=e2e-cross-build /usr/local/bin/gotestsum-win...
#27 DONE 0.1s

#28 [e2e-cross 7/9] COPY --from=e2e-cross-build /usr/local/bin/test2json-lin...
#28 DONE 0.1s

#29 [e2e-cross 8/9] COPY --from=e2e-cross-build /usr/local/bin/test2json-dar...
#29 DONE 0.1s

#30 [e2e-cross 9/9] COPY --from=e2e-cross-build /usr/local/bin/test2json-win...
#30 DONE 0.1s

#31 exporting to client
#31 copying files 13.80MB 0.1s
#31 copying files 121.57MB 0.8s done
#31 DONE 1.3s
tar --transform='flags=r;s|docker-app-linux|docker-app-plugin-linux|' -czf bin/docker-app-linux.tar.gz -C bin docker-app-linux
tar czf bin/docker-app-e2e-linux.tar.gz -C bin docker-app-e2e-linux
tar --transform='flags=r;s|docker-app-darwin|docker-app-plugin-darwin|' -czf bin/docker-app-darwin.tar.gz -C bin docker-app-darwin
tar czf bin/docker-app-e2e-darwin.tar.gz -C bin docker-app-e2e-darwin
tar --transform='flags=r;s|docker-app-windows|docker-app-plugin-windows|' -czf bin/docker-app-windows.tar.gz -C bin docker-app-windows.exe
tar czf bin/docker-app-e2e-windows.tar.gz -C bin docker-app-e2e-windows.exe
[Pipeline] }
[Pipeline] // ansiColor
[Pipeline] dir
Running in /home/ubuntu/workspace/app_PR-719/src/github.com/docker/app/bin
[Pipeline] {
[Pipeline] stash
Stashed 21 file(s) to https://corp-us-east-1-jenkins-k8s-maste-jenkinsartifacts-1lzm7adht5e1j.s3.amazonaws.com/public/app/PR-719/38/stashes/binaries.tgz
[Pipeline] }
[Pipeline] // dir
[Pipeline] dir
Running in /home/ubuntu/workspace/app_PR-719/src/github.com/docker/app/e2e
[Pipeline] {
[Pipeline] stash
Stashed 75 file(s) to https://corp-us-east-1-jenkins-k8s-maste-jenkinsartifacts-1lzm7adht5e1j.s3.amazonaws.com/public/app/PR-719/38/stashes/e2e.tgz
[Pipeline] }
[Pipeline] // dir
[Pipeline] dir
Running in /home/ubuntu/workspace/app_PR-719/src/github.com/docker/app/examples
[Pipeline] {
[Pipeline] stash
Stashed 48 file(s) to https://corp-us-east-1-jenkins-k8s-maste-jenkinsartifacts-1lzm7adht5e1j.s3.amazonaws.com/public/app/PR-719/38/stashes/examples.tgz
[Pipeline] }
[Pipeline] // dir
[Pipeline] sh
+ xargs --no-run-if-empty docker image rm -f
+ docker image ls --format={{.Repository}}:{{.Tag}} *jenkins-app-PR-719-38*
[Pipeline] }
[Pipeline] // script
[Pipeline] }
[Pipeline] // dir
Post stage
[Pipeline] deleteDir
[Pipeline] }
[Pipeline] // node
[Pipeline] }
[Pipeline] // stage
[Pipeline] }
[Pipeline] // parallel
[Pipeline] }
[Pipeline] // stage
[Pipeline] stage
[Pipeline] { (Test)
[Pipeline] parallel
[Pipeline] { (Branch: Coverage)
[Pipeline] { (Branch: Test Linux)
[Pipeline] stage
[Pipeline] { (Coverage)
[Pipeline] stage
[Pipeline] { (Test Linux)
[Pipeline] node
[Pipeline] node
Running on ubuntu-1804-overlay2 (i-02676d5538229dc84) in /home/ubuntu/workspace/app_PR-719
[Pipeline] {
Running on ubuntu-1804-overlay2 (i-0b885d95133e67e6c) in /home/ubuntu/workspace/app_PR-719
[Pipeline] dir
Running in /home/ubuntu/workspace/app_PR-719/src/github.com/docker/app
[Pipeline] {
[Pipeline] {
[Pipeline] checkout
[Pipeline] withEnv
[Pipeline] {
using credential docker-jenkins-github-credentials
[Pipeline] dir
Running in /home/ubuntu/workspace/app_PR-719/src/github.com/docker/app
[Pipeline] {
Cloning the remote Git repository
Cloning with configured refspecs honoured and without tags
[Pipeline] checkout
using credential docker-jenkins-github-credentials
Cloning the remote Git repository
Cloning with configured refspecs honoured and without tags
Cloning repository https://github.com/docker/app.git
 > git init /home/ubuntu/workspace/app_PR-719/src/github.com/docker/app # timeout=10
Fetching upstream changes from https://github.com/docker/app.git
 > git --version # timeout=10
using GIT_ASKPASS to set credentials docker-jenkins GitHub credentials
 > git fetch --no-tags --progress -- https://github.com/docker/app.git +refs/pull/719/head:refs/remotes/origin/PR-719
Cloning repository https://github.com/docker/app.git
 > git init /home/ubuntu/workspace/app_PR-719/src/github.com/docker/app # timeout=10
Fetching upstream changes from https://github.com/docker/app.git
 > git --version # timeout=10
using GIT_ASKPASS to set credentials docker-jenkins GitHub credentials
 > git fetch --no-tags --progress -- https://github.com/docker/app.git +refs/pull/719/head:refs/remotes/origin/PR-719
Fetching without tags
Checking out Revision 493501a17db304be2d10f3c134403014002fb4d3 (PR-719)
 > git config remote.origin.url https://github.com/docker/app.git # timeout=10
 > git config --add remote.origin.fetch +refs/pull/719/head:refs/remotes/origin/PR-719 # timeout=10
 > git config remote.origin.url https://github.com/docker/app.git # timeout=10
Fetching upstream changes from https://github.com/docker/app.git
using GIT_ASKPASS to set credentials docker-jenkins GitHub credentials
 > git fetch --no-tags --progress -- https://github.com/docker/app.git +refs/pull/719/head:refs/remotes/origin/PR-719
Commit message: "fix coverage issues"
Fetching without tags
Checking out Revision 493501a17db304be2d10f3c134403014002fb4d3 (PR-719)
Commit message: "fix coverage issues"
 > git config core.sparsecheckout # timeout=10
 > git checkout -f 493501a17db304be2d10f3c134403014002fb4d3
 > git config remote.origin.url https://github.com/docker/app.git # timeout=10
 > git config --add remote.origin.fetch +refs/pull/719/head:refs/remotes/origin/PR-719 # timeout=10
 > git config remote.origin.url https://github.com/docker/app.git # timeout=10
Fetching upstream changes from https://github.com/docker/app.git
using GIT_ASKPASS to set credentials docker-jenkins GitHub credentials
 > git fetch --no-tags --progress -- https://github.com/docker/app.git +refs/pull/719/head:refs/remotes/origin/PR-719
 > git config core.sparsecheckout # timeout=10
 > git checkout -f 493501a17db304be2d10f3c134403014002fb4d3
[Pipeline] dir
Running in /home/ubuntu/workspace/app_PR-719/src/github.com/docker/app/_build
[Pipeline] {
[Pipeline] unstash
[Pipeline] dir
Running in /home/ubuntu/workspace/app_PR-719/src/github.com/docker/app/_build
[Pipeline] {
[Pipeline] unstash
Unstashed file(s) from https://corp-us-east-1-jenkins-k8s-maste-jenkinsartifacts-1lzm7adht5e1j.s3.amazonaws.com/public/app/PR-719/38/stashes/coverage-invocation-image.tgz
[Pipeline] sh
+ docker load -i coverage-invocation-image.tar
Loaded image: docker/cnab-app-base:jenkins-app-PR-719-38-coverage
[Pipeline] }
[Pipeline] // dir
[Pipeline] ansiColor
[Pipeline] {
[Pipeline] sh
Unstashed file(s) from https://corp-us-east-1-jenkins-k8s-maste-jenkinsartifacts-1lzm7adht5e1j.s3.amazonaws.com/public/app/PR-719/38/stashes/invocation-image.tgz
[Pipeline] sh
+ make -f docker.Makefile TAG=jenkins-app-PR-719-38-coverage coverage-run
docker build --build-arg TAG=jenkins-app-PR-719-38-coverage --build-arg COMMIT=493501a1 --build-arg ALPINE_VERSION=3.10.3 --build-arg GOPROXY=direct --target=dev -t docker-app-dev:jenkins-app-PR-719-38 .
#2 [internal] load build definition from Dockerfile
#2 transferring dockerfile: 3.83kB done
#2 DONE 0.0s

#1 [internal] load .dockerignore
#1 transferring context: 73B done
#1 DONE 0.0s

#4 [internal] load metadata for docker.io/dockercore/golang-cross:1.12.9@sh...
#4 DONE 0.2s

#3 [internal] load metadata for docker.io/library/golang:1.13.3
#3 DONE 0.2s

#5 [dev 1/9] FROM docker.io/library/golang:1.13.3@sha256:6a693fbaba7dd8d816...
#5 resolve docker.io/library/golang:1.13.3@sha256:6a693fbaba7dd8d816f6afce049fb92b280c588e0a677c4c8db26645e613fc15 done
#5 sha256:dc7582e06f8e0a61b450f02b8ab83484acc6b437a75b4e9959f11a964aea1169 5.46kB / 5.46kB done
#5 sha256:f332e1ccc3d895f13e9660c053e8bda16c4894c5179526cf7702ad014cd5fa88 0B / 120.06MB 0.1s
#5 sha256:6a693fbaba7dd8d816f6afce049fb92b280c588e0a677c4c8db26645e613fc15 2.16kB / 2.16kB done
#5 sha256:07e0a3e016334dc43ddfb498264511edf2341c6a4c9ceea921f6100e70bae220 0B / 125B 0.1s
#5 sha256:3d607e3e3a9dd7d1094b634e6d1f69ae65f5d9a2193d3b3b9fd46b780bd221fe 1.79kB / 1.79kB done
+ docker load -i invocation-image.tar
#5 sha256:f332e1ccc3d895f13e9660c053e8bda16c4894c5179526cf7702ad014cd5fa88 12.41MB / 120.06MB 0.3s
#5 sha256:07e0a3e016334dc43ddfb498264511edf2341c6a4c9ceea921f6100e70bae220 125B / 125B 0.1s done
#5 sha256:f332e1ccc3d895f13e9660c053e8bda16c4894c5179526cf7702ad014cd5fa88 21.22MB / 120.06MB 0.5s
#5 sha256:f332e1ccc3d895f13e9660c053e8bda16c4894c5179526cf7702ad014cd5fa88 28.70MB / 120.06MB 0.7s
#5 sha256:f332e1ccc3d895f13e9660c053e8bda16c4894c5179526cf7702ad014cd5fa88 37.91MB / 120.06MB 0.9s
Loaded image: docker/cnab-app-base:jenkins-app-PR-719-38
[Pipeline] }
[Pipeline] // dir
[Pipeline] unstash
#5 sha256:f332e1ccc3d895f13e9660c053e8bda16c4894c5179526cf7702ad014cd5fa88 47.05MB / 120.06MB 1.1s
#5 sha256:f332e1ccc3d895f13e9660c053e8bda16c4894c5179526cf7702ad014cd5fa88 58.09MB / 120.06MB 1.4s
#5 sha256:f332e1ccc3d895f13e9660c053e8bda16c4894c5179526cf7702ad014cd5fa88 70.57MB / 120.06MB 1.7s
#5 sha256:f332e1ccc3d895f13e9660c053e8bda16c4894c5179526cf7702ad014cd5fa88 76.80MB / 120.06MB 1.8s
#5 sha256:f332e1ccc3d895f13e9660c053e8bda16c4894c5179526cf7702ad014cd5fa88 90.07MB / 120.06MB 2.0s
#5 sha256:f332e1ccc3d895f13e9660c053e8bda16c4894c5179526cf7702ad014cd5fa88 103.30MB / 120.06MB 2.3s
#5 sha256:f332e1ccc3d895f13e9660c053e8bda16c4894c5179526cf7702ad014cd5fa88 112.59MB / 120.06MB 2.5s
#5 sha256:f332e1ccc3d895f13e9660c053e8bda16c4894c5179526cf7702ad014cd5fa88 120.06MB / 120.06MB 2.7s
#5 sha256:f332e1ccc3d895f13e9660c053e8bda16c4894c5179526cf7702ad014cd5fa88 120.06MB / 120.06MB 3.4s done
#5 extracting sha256:f332e1ccc3d895f13e9660c053e8bda16c4894c5179526cf7702ad014cd5fa88
#5 ...

#8 [cli-build 1/5] FROM docker.io/dockercore/golang-cross:1.12.9@sha256:3ea...
#8 resolve docker.io/dockercore/golang-cross:1.12.9@sha256:3ea9dcef4dd2c46d80445c0b22d6177817f4cfce22c523cc12a5a1091cb37705 done
#8 sha256:3ea9dcef4dd2c46d80445c0b22d6177817f4cfce22c523cc12a5a1091cb37705 2.63kB / 2.63kB done
#8 sha256:518d5e4626aaef11e9ad8f78c5055efce60445a5dcbfe2ba3d99df5370902367 6.97kB / 6.97kB done
#8 sha256:4ae16bd4778367b46064f39554128dd2fda2803a5747fddeff74059f353391c9 50.38MB / 50.38MB 1.2s done
#8 sha256:bbab4ec87ac4f89eaabdf68dddbd1dd930e3ad43bded38d761b89abf9389a893 7.80MB / 7.80MB 0.2s done
#8 sha256:2ea1f7804402db2da64e84a26bd591f41667ad69cd7f2a2c6106d9bb04dde260 9.98MB / 9.98MB 0.6s done
#8 sha256:96465440c20877524189ae75d361dd29e5d0df330a8dac9427f972b429fe0159 51.77MB / 51.77MB 1.8s done
#8 sha256:16a3d8aca6cd76595d0fa99f7dcaf6c388c021bc6f5020d794e8292b88e5aac3 68.48MB / 68.48MB 3.3s done
#8 extracting sha256:4ae16bd4778367b46064f39554128dd2fda2803a5747fddeff74059f353391c9 4.6s
#8 sha256:e0ec5610455ae43994616afca2caf7da592cb975d7474ed112baa42e5c616d17 127.97MB / 127.97MB 4.7s done
#8 sha256:39007eb4600844b025a9527ab141ae020bb350982baf0df7dd96c80c4a0f312e 270B / 270B 3.5s done
#8 sha256:96d705baf026261543501205212451776c49ddaa48a0347afab3494275e0fc13 125B / 125B 3.4s done
#8 sha256:4e549f0f5e64911cbbdc123a749d1ae352ad2be720fd1e2b259a802400fb412f 122.66MB / 163.50MB 6.1s
#8 sha256:c0058a8c71f2a8f493571a5456cfc99585ed21798b735f8fc54460904a3bd232 950B / 950B 3.6s done
#8 sha256:2f8d98df0991fd5b02a9f791cb766f66d83016b1b831e1b5e58438a8cb6de207 121.86MB / 290.76MB 6.1s
#8 sha256:4e549f0f5e64911cbbdc123a749d1ae352ad2be720fd1e2b259a802400fb412f 134.60MB / 163.50MB 6.4s
#8 sha256:2f8d98df0991fd5b02a9f791cb766f66d83016b1b831e1b5e58438a8cb6de207 138.50MB / 290.76MB 6.4s
#8 sha256:4e549f0f5e64911cbbdc123a749d1ae352ad2be720fd1e2b259a802400fb412f 155.87MB / 163.50MB 6.8s
#8 sha256:2f8d98df0991fd5b02a9f791cb766f66d83016b1b831e1b5e58438a8cb6de207 158.49MB / 290.76MB 6.8s
#8 sha256:2f8d98df0991fd5b02a9f791cb766f66d83016b1b831e1b5e58438a8cb6de207 183.61MB / 290.76MB 7.1s
#8 sha256:2f8d98df0991fd5b02a9f791cb766f66d83016b1b831e1b5e58438a8cb6de207 201.07MB / 290.76MB 7.3s
#8 sha256:2f8d98df0991fd5b02a9f791cb766f66d83016b1b831e1b5e58438a8cb6de207 225.13MB / 290.76MB 7.6s
#8 sha256:2f8d98df0991fd5b02a9f791cb766f66d83016b1b831e1b5e58438a8cb6de207 243.90MB / 290.76MB 7.9s
#8 sha256:4e549f0f5e64911cbbdc123a749d1ae352ad2be720fd1e2b259a802400fb412f 163.50MB / 163.50MB 8.2s done
#8 sha256:2f8d98df0991fd5b02a9f791cb766f66d83016b1b831e1b5e58438a8cb6de207 268.56MB / 290.76MB 8.3s
#8 sha256:2f8d98df0991fd5b02a9f791cb766f66d83016b1b831e1b5e58438a8cb6de207 290.76MB / 290.76MB 8.6s
Unstashed file(s) from https://corp-us-east-1-jenkins-k8s-maste-jenkinsartifacts-1lzm7adht5e1j.s3.amazonaws.com/public/app/PR-719/38/stashes/binaries.tgz
[Pipeline] dir
Running in /home/ubuntu/workspace/app_PR-719/src/github.com/docker/app/examples
[Pipeline] {
[Pipeline] unstash
#8 ...

#18 [internal] load build context
#18 transferring context: 73.02MB 9.0s done
#18 DONE 10.0s

#8 [cli-build 1/5] FROM docker.io/dockercore/golang-cross:1.12.9@sha256:3ea...
Unstashed file(s) from https://corp-us-east-1-jenkins-k8s-maste-jenkinsartifacts-1lzm7adht5e1j.s3.amazonaws.com/public/app/PR-719/38/stashes/examples.tgz
[Pipeline] }
[Pipeline] // dir
[Pipeline] dir
Running in /home/ubuntu/workspace/app_PR-719/src/github.com/docker/app/e2e
[Pipeline] {
[Pipeline] unstash
Unstashed file(s) from https://corp-us-east-1-jenkins-k8s-maste-jenkinsartifacts-1lzm7adht5e1j.s3.amazonaws.com/public/app/PR-719/38/stashes/e2e.tgz
[Pipeline] }
[Pipeline] // dir
[Pipeline] ansiColor
[Pipeline] {
[Pipeline] sh
+ ./gotestsum-linux --format short-verbose --junitfile e2e-linux.xml --raw-command -- ./test2json-linux -t -p e2e/linux ./docker-app-e2e-linux -test.v --e2e-path=e2e
#8 extracting sha256:4ae16bd4778367b46064f39554128dd2fda2803a5747fddeff74059f353391c9 9.8s
#8 extracting sha256:4ae16bd4778367b46064f39554128dd2fda2803a5747fddeff74059f353391c9 9.9s done
#8 sha256:2f8d98df0991fd5b02a9f791cb766f66d83016b1b831e1b5e58438a8cb6de207 290.76MB / 290.76MB 11.3s done
#8 extracting sha256:bbab4ec87ac4f89eaabdf68dddbd1dd930e3ad43bded38d761b89abf9389a893
#8 extracting sha256:bbab4ec87ac4f89eaabdf68dddbd1dd930e3ad43bded38d761b89abf9389a893 0.5s done
#8 extracting sha256:2ea1f7804402db2da64e84a26bd591f41667ad69cd7f2a2c6106d9bb04dde260
#8 extracting sha256:2ea1f7804402db2da64e84a26bd591f41667ad69cd7f2a2c6106d9bb04dde260 0.5s done
#8 extracting sha256:96465440c20877524189ae75d361dd29e5d0df330a8dac9427f972b429fe0159
#8 ...

#5 [dev 1/9] FROM docker.io/library/golang:1.13.3@sha256:6a693fbaba7dd8d816...
#5 extracting sha256:f332e1ccc3d895f13e9660c053e8bda16c4894c5179526cf7702ad014cd5fa88 12.1s done
#5 extracting sha256:07e0a3e016334dc43ddfb498264511edf2341c6a4c9ceea921f6100e70bae220 0.0s done
#5 DONE 16.5s

#8 [cli-build 1/5] FROM docker.io/dockercore/golang-cross:1.12.9@sha256:3ea...
#8 extracting sha256:96465440c20877524189ae75d361dd29e5d0df330a8dac9427f972b429fe0159 4.0s done
#8 extracting sha256:16a3d8aca6cd76595d0fa99f7dcaf6c388c021bc6f5020d794e8292b88e5aac3
#8 extracting sha256:16a3d8aca6cd76595d0fa99f7dcaf6c388c021bc6f5020d794e8292b88e5aac3 4.0s done
#8 extracting sha256:e0ec5610455ae43994616afca2caf7da592cb975d7474ed112baa42e5c616d17
#8 extracting sha256:e0ec5610455ae43994616afca2caf7da592cb975d7474ed112baa42e5c616d17 5.1s
#8 ...

#6 [dev 2/9] RUN apt-get update && apt-get install -y -q --no-install-recom...
#6 1.260 Get:1 http://security.debian.org/debian-security buster/updates InRelease [39.1 kB]
#6 1.270 Get:2 http://deb.debian.org/debian buster InRelease [122 kB]
#6 1.270 Get:3 http://deb.debian.org/debian buster-updates InRelease [49.3 kB]
#6 1.429 Get:4 http://security.debian.org/debian-security buster/updates/main amd64 Packages [113 kB]
#6 1.592 Get:5 http://deb.debian.org/debian buster/main amd64 Packages [7899 kB]
#6 2.035 Get:6 http://deb.debian.org/debian buster-updates/main amd64 Packages [5792 B]
#6 3.979 Fetched 8227 kB in 3s (2909 kB/s)
#6 3.979 Reading package lists...
#6 4.969 Reading package lists...
#6 5.887 Building dependency tree...
#6 6.073 Reading state information...
#6 6.289 coreutils is already the newest version (8.30-3).
#6 6.289 coreutils set to manually installed.
#6 6.289 util-linux is already the newest version (2.33.1-0.1).
#6 6.289 util-linux set to manually installed.
#6 6.289 The following NEW packages will be installed:
#6 6.289   uuid-runtime
#6 6.554 0 upgraded, 1 newly installed, 0 to remove and 0 not upgraded.
#6 6.554 Need to get 95.2 kB of archives.
#6 6.554 After this operation, 211 kB of additional disk space will be used.
#6 6.554 Get:1 http://deb.debian.org/debian buster/main amd64 uuid-runtime amd64 2.33.1-0.1 [95.2 kB]
#6 6.724 debconf: delaying package configuration, since apt-utils is not installed
#6 6.752 Fetched 95.2 kB in 0s (370 kB/s)
#6 6.785 Selecting previously unselected package uuid-runtime.
#6 6.785 (Reading database ... 
(Reading database ... 5%
(Reading database ... 10%
(Reading database ... 15%
(Reading database ... 20%
(Reading database ... 25%
(Reading database ... 30%
(Reading database ... 35%
(Reading database ... 40%
(Reading database ... 45%
(Reading database ... 50%
(Reading database ... 55%
(Reading database ... 60%
(Reading database ... 65%
(Reading database ... 70%
(Reading database ... 75%
(Reading database ... 80%
(Reading database ... 85%
(Reading database ... 90%
(Reading database ... 95%
(Reading database ... 100%
(Reading database ... 15394 files and directories currently installed.)
#6 6.792 Preparing to unpack .../uuid-runtime_2.33.1-0.1_amd64.deb ...
#6 6.795 Unpacking uuid-runtime (2.33.1-0.1) ...
#6 6.856 Setting up uuid-runtime (2.33.1-0.1) ...
#6 6.900 Adding group `uuidd' (GID 102) ...
#6 6.941 Done.
#6 6.974 Warning: The home dir /run/uuidd you specified can't be accessed: No such file or directory
#6 6.974 Adding system user `uuidd' (UID 101) ...
#6 6.975 Adding new user `uuidd' (UID 101) with group `uuidd' ...
#6 7.021 Not creating home directory `/run/uuidd'.
#6 7.041 invoke-rc.d: could not determine current runlevel
#6 7.045 invoke-rc.d: policy-rc.d denied execution of start.
#6 ...

#8 [cli-build 1/5] FROM docker.io/dockercore/golang-cross:1.12.9@sha256:3ea...
#8 extracting sha256:e0ec5610455ae43994616afca2caf7da592cb975d7474ed112baa42e5c616d17 5.4s done
#8 extracting sha256:96d705baf026261543501205212451776c49ddaa48a0347afab3494275e0fc13 done
#8 extracting sha256:39007eb4600844b025a9527ab141ae020bb350982baf0df7dd96c80c4a0f312e
#8 extracting sha256:39007eb4600844b025a9527ab141ae020bb350982baf0df7dd96c80c4a0f312e done
#8 extracting sha256:4e549f0f5e64911cbbdc123a749d1ae352ad2be720fd1e2b259a802400fb412f 0.1s
#8 ...

#6 [dev 2/9] RUN apt-get update && apt-get install -y -q --no-install-recom...
#6 DONE 11.9s

#8 [cli-build 1/5] FROM docker.io/dockercore/golang-cross:1.12.9@sha256:3ea...
#8 ...

#7 [dev 3/9] WORKDIR /go/src/github.com/docker/app/
#7 DONE 0.1s

#8 [cli-build 1/5] FROM docker.io/dockercore/golang-cross:1.12.9@sha256:3ea...
#8 extracting sha256:4e549f0f5e64911cbbdc123a749d1ae352ad2be720fd1e2b259a802400fb412f 5.2s
#8 extracting sha256:4e549f0f5e64911cbbdc123a749d1ae352ad2be720fd1e2b259a802400fb412f 6.0s done
#8 extracting sha256:c0058a8c71f2a8f493571a5456cfc99585ed21798b735f8fc54460904a3bd232 done
#8 extracting sha256:2f8d98df0991fd5b02a9f791cb766f66d83016b1b831e1b5e58438a8cb6de207
PASS e2e/linux.TestBuild (22.49s)
#8 extracting sha256:2f8d98df0991fd5b02a9f791cb766f66d83016b1b831e1b5e58438a8cb6de207 5.0s
#8 extracting sha256:2f8d98df0991fd5b02a9f791cb766f66d83016b1b831e1b5e58438a8cb6de207 10.1s
PASS e2e/linux.TestQuietBuild (13.13s)
#8 extracting sha256:2f8d98df0991fd5b02a9f791cb766f66d83016b1b831e1b5e58438a8cb6de207 14.9s done
#8 DONE 49.9s

#9 [cli-build 2/5] RUN apt-get install -y -q --no-install-recommends   core...
#9 0.637 Reading package lists...
#9 1.216 Building dependency tree...
#9 1.314 Reading state information...
#9 1.480 coreutils is already the newest version (8.30-3).
#9 1.480 coreutils set to manually installed.
#9 1.480 util-linux is already the newest version (2.33.1-0.1).
#9 1.480 util-linux set to manually installed.
#9 1.480 The following NEW packages will be installed:
#9 1.480   uuid-runtime
#9 1.754 0 upgraded, 1 newly installed, 0 to remove and 1 not upgraded.
#9 1.754 Need to get 95.2 kB of archives.
#9 1.754 After this operation, 211 kB of additional disk space will be used.
#9 1.754 Get:1 http://deb.debian.org/debian buster/main amd64 uuid-runtime amd64 2.33.1-0.1 [95.2 kB]
#9 1.912 debconf: delaying package configuration, since apt-utils is not installed
#9 1.947 Fetched 95.2 kB in 0s (367 kB/s)
#9 2.229 Selecting previously unselected package uuid-runtime.
#9 2.229 (Reading database ... 
(Reading database ... 5%
(Reading database ... 10%
(Reading database ... 15%
(Reading database ... 20%
(Reading database ... 25%
(Reading database ... 30%
(Reading database ... 35%
(Reading database ... 40%
(Reading database ... 45%
(Reading database ... 50%
(Reading database ... 55%
(Reading database ... 60%
(Reading database ... 65%
(Reading database ... 70%
(Reading database ... 75%
(Reading database ... 80%
(Reading database ... 85%
(Reading database ... 90%
(Reading database ... 95%
(Reading database ... 100%
(Reading database ... 25419 files and directories currently installed.)
#9 2.244 Preparing to unpack .../uuid-runtime_2.33.1-0.1_amd64.deb ...
#9 2.258 Unpacking uuid-runtime (2.33.1-0.1) ...
#9 2.657 Setting up uuid-runtime (2.33.1-0.1) ...
#9 2.850 Adding group `uuidd' (GID 102) ...
#9 2.882 Done.
#9 2.910 Warning: The home dir /run/uuidd you specified can't be accessed: No such file or directory
#9 2.910 Adding system user `uuidd' (UID 101) ...
#9 2.911 Adding new user `uuidd' (UID 101) with group `uuidd' ...
#9 3.296 Not creating home directory `/run/uuidd'.
#9 3.309 invoke-rc.d: could not determine current runlevel
#9 3.312 invoke-rc.d: policy-rc.d denied execution of start.
#9 DONE 5.7s

#10 [cli-build 3/5] WORKDIR /go/src/github.com/docker/cli
#10 DONE 0.0s

#11 [cli-build 4/5] RUN git clone https://github.com/docker/cli . && git che...
#11 0.663 Cloning into '.'...
PASS e2e/linux.TestBuildWithoutTag (13.02s)
#11 4.391 Note: checking out 'a1b83ffd2cbeefc0752e5aa7a543d49c1ddfd2cb'.
#11 4.391 
#11 4.391 You are in 'detached HEAD' state. You can look around, make experimental
#11 4.391 changes and commit them, and you can discard any commits you make in this
#11 4.391 state without impacting any branches by performing another checkout.
#11 4.391 
#11 4.391 If you want to create a new branch to retain commits you create, you may
#11 4.391 do so (now or later) by using -b with the checkout command again. Example:
#11 4.391 
#11 4.391   git checkout -b <new-branch-name>
#11 4.391 
#11 4.391 HEAD is now at a1b83ffd Merge pull request #1894 from thaJeztah/19.03_backport_reduce_vendoring_impact
#11 DONE 5.0s

#12 [cli-build 5/5] RUN make binary-osx binary-windows binary
#12 0.675 ./scripts/build/osx
#12 0.698 Building build/docker-darwin-amd64
PASS e2e/linux.TestBuildWithArgs (13.01s)
PASS e2e/linux.TestBuildWithArgsDefinedTwice (12.15s)
PASS e2e/linux.TestCallCustomStatusAction/validCustomDockerStatusAction (3.02s)
PASS e2e/linux.TestCallCustomStatusAction/validCustomStandardStatusAction (2.84s)
PASS e2e/linux.TestCallCustomStatusAction/missingCustomStatusAction (3.26s)
PASS e2e/linux.TestCallCustomStatusAction (9.11s)
PASS e2e/linux.TestCnabParameters (2.93s)
PASS e2e/linux.TestExitErrorCode (0.06s)
PASS e2e/linux.TestRender/envvariables/stdout (1.43s)
PASS e2e/linux.TestRender/envvariables/file (1.36s)
PASS e2e/linux.TestRender/envvariables (3.56s)
PASS e2e/linux.TestRender (3.56s)
PASS e2e/linux.TestRenderAppNotFound (0.18s)
PASS e2e/linux.TestRenderFormatters (14.34s)
PASS e2e/linux.TestInit (0.13s)
PASS e2e/linux.TestInspectApp (13.69s)
PASS e2e/linux.TestRunOnlyOne (0.12s)
PASS e2e/linux.TestRunWithLabels (15.82s)
#12 87.73 ./scripts/build/windows
#12 87.75 Generating windows resources
#12 87.80 Building build/docker-windows-amd64
PASS e2e/linux.TestDockerAppLifecycle (27.10s)
PASS e2e/linux.TestCredentials/missing (0.06s)
PASS e2e/linux.TestCredentials/full (1.93s)
PASS e2e/linux.TestCredentials/mixed-credstore (1.31s)
PASS e2e/linux.TestCredentials/mixed-local-cred (1.31s)
PASS e2e/linux.TestCredentials/overload (0.07s)
PASS e2e/linux.TestCredentials (4.69s)
PASS e2e/linux.TestRenderWithEnvFile (2.19s)
PASS e2e/linux.TestExamplesAreValid (0.26s)
PASS e2e/linux.TestImageList (14.17s)
PASS e2e/linux.TestImageListQuiet (13.72s)
PASS e2e/linux.TestImageListDigests (13.58s)
PASS e2e/linux.TestImageRm (13.89s)
#12 171.5 WARNING: binary creates a Linux executable. Use cross for macOS or Windows.
#12 171.5 ./scripts/build/binary
#12 171.5 Building statically linked build/docker-linux-amd64
PASS e2e/linux.TestImageTag (14.92s)
PASS e2e/linux.TestInvokePluginFromCLI (3.99s)
PASS e2e/linux.TestPushInsecureRegistry (28.46s)
PASS e2e/linux.TestPushInstall (22.65s)
#12 DONE 242.9s

#13 [dev 4/9] COPY --from=cli-build /go/src/github.com/docker/cli/build/dock...
#13 DONE 0.4s

#14 [dev 5/9] RUN curl -o /usr/bin/dep -L https://github.com/golang/dep/rele...
#14 0.774   % Total    % Received % Xferd  Average Speed   Time    Time     Time  Current
#14 0.774                                  Dload  Upload   Total   Spent    Left  Speed
#14 0.775 
  0     0    0     0    0     0      0      0 --:--:-- --:--:-- --:--:--     0
100   605    0   605    0     0   4006      0 --:--:-- --:--:-- --:--:--  4033
#14 1.046 
100 10.5M  100 10.5M    0     0  38.7M      0 --:--:-- --:--:-- --:--:-- 38.7M
#14 DONE 1.2s

#15 [dev 6/9] RUN mkdir /go/src/gotest.tools &&   git clone -q https://githu...
#15 11.73 go: downloading gotest.tools v2.1.0+incompatible
#15 11.77 go: extracting gotest.tools v2.1.0+incompatible
#15 11.77 go: downloading github.com/pkg/errors v0.8.0
#15 11.78 go: downloading github.com/spf13/pflag v1.0.1
#15 11.78 go: downloading github.com/sirupsen/logrus v1.0.5
#15 11.78 go: downloading github.com/fatih/color v1.6.0
#15 11.80 go: downloading github.com/jonboulle/clockwork v0.1.0
#15 11.80 go: downloading golang.org/x/sync v0.0.0-20180314180146-1d60e4601c6f
#15 11.83 go: extracting github.com/pkg/errors v0.8.0
#15 11.85 go: extracting github.com/sirupsen/logrus v1.0.5
#15 11.86 go: downloading golang.org/x/sys v0.0.0-20180909124046-d0be0721c37e
#15 11.86 go: downloading golang.org/x/crypto v0.0.0-20180426230345-b49d69b5da94
#15 11.90 go: extracting github.com/jonboulle/clockwork v0.1.0
#15 11.90 go: extracting github.com/spf13/pflag v1.0.1
#15 11.90 go: extracting golang.org/x/sync v0.0.0-20180314180146-1d60e4601c6f
#15 11.91 go: downloading golang.org/x/net v0.0.0-20181102091132-c10e9556a7bc
#15 12.23 go: extracting github.com/fatih/color v1.6.0
#15 12.23 go: downloading github.com/mattn/go-isatty v0.0.3
#15 12.23 go: downloading github.com/mattn/go-colorable v0.0.9
#15 12.28 go: extracting github.com/mattn/go-colorable v0.0.9
#15 12.28 go: extracting github.com/mattn/go-isatty v0.0.3
#15 12.82 go: extracting golang.org/x/crypto v0.0.0-20180426230345-b49d69b5da94
#15 13.00 go: extracting golang.org/x/net v0.0.0-20181102091132-c10e9556a7bc
#15 13.08 go: extracting golang.org/x/sys v0.0.0-20180909124046-d0be0721c37e
#15 13.16 go: finding github.com/fatih/color v1.6.0
#15 13.16 go: finding github.com/pkg/errors v0.8.0
#15 13.17 go: finding github.com/sirupsen/logrus v1.0.5
#15 13.18 go: finding github.com/spf13/pflag v1.0.1
#15 13.18 go: finding github.com/mattn/go-colorable v0.0.9
#15 13.18 go: finding github.com/mattn/go-isatty v0.0.3
#15 13.20 go: finding golang.org/x/crypto v0.0.0-20180426230345-b49d69b5da94
#15 13.20 go: finding golang.org/x/sys v0.0.0-20180909124046-d0be0721c37e
#15 13.21 go: finding github.com/jonboulle/clockwork v0.1.0
#15 13.22 go: finding golang.org/x/sync v0.0.0-20180314180146-1d60e4601c6f
#15 13.23 go: finding golang.org/x/net v0.0.0-20181102091132-c10e9556a7bc
PASS e2e/linux.TestPushPullInstall (17.98s)
#15 DONE 35.2s

#16 [dev 7/9] RUN GOOS=linux   go build -o /usr/local/bin/test2json-linux   ...
#16 DONE 2.1s

#17 [dev 8/9] RUN go get -d gopkg.in/mjibson/esc.v0 &&   cd /go/src/github.c...
PASS e2e/linux.TestPushInstallBundle/push-bundle (5.16s)
PASS e2e/linux.TestPushInstallBundle/push-ref (1.83s)
PASS e2e/linux.TestPushInstallBundle/push-bundleref (1.75s)
PASS e2e/linux.TestPushInstallBundle (24.43s)
#17 7.858 golang.org/x/tools/internal/semver
#17 7.889 github.com/pkg/errors
#17 7.912 golang.org/x/tools/go/ast/astutil
#17 7.941 golang.org/x/tools/go/internal/gcimporter
#17 8.216 golang.org/x/tools/go/internal/packagesdriver
#17 8.290 golang.org/x/tools/internal/fastwalk
#17 8.369 golang.org/x/tools/internal/gopathwalk
#17 8.447 golang.org/x/tools/internal/span
#17 8.623 golang.org/x/tools/internal/module
#17 8.670 golang.org/x/tools/go/gcexportdata
#17 8.720 golang.org/x/tools/go/packages
#17 8.963 golang.org/x/tools/internal/imports
#17 9.352 golang.org/x/tools/imports
#17 9.363 github.com/mjibson/esc/embed
#17 9.404 github.com/mjibson/esc
#17 DONE 10.8s

#19 [dev 9/9] COPY . .
#19 DONE 1.8s

#20 exporting to image
#20 exporting layers
#20 exporting layers 2.0s done
#20 writing image sha256:6301727cbc3d7c12095f3e67f1d908fd4275581c8df1c494d7e1cbfaad0f22a3 done
#20 naming to docker.io/library/docker-app-dev:jenkins-app-PR-719-38 done
#20 DONE 2.0s
docker run -v /var/run:/var/run:ro --name docker-app-cov-jenkins-app-PR-719-38-coverage --network="host" -t docker-app-dev:jenkins-app-PR-719-38 make COMMIT=493501a1 TAG=jenkins-app-PR-719-38-coverage TEST_RESULTS_PREFIX= coverage
Running unit tests (coverage)...
CGO_ENABLED=0 gotestsum --junitfile _build/test-results/unit-coverage.xml -- -tags= -ldflags="-s -w -X github.com/docker/app/internal.GitCommit=493501a1 -X github.com/docker/app/internal.Version=jenkins-app-PR-719-38-coverage -X github.com/docker/app/internal.BuildTime=2019-11-08T07:56:52Z" -cover -test.coverprofile=_build/cov/unit.out github.com/docker/app github.com/docker/app/cmd/cnab-run github.com/docker/app/cmd/docker-app github.com/docker/app/docs/yaml github.com/docker/app/internal github.com/docker/app/internal/bundle github.com/docker/app/internal/cliopts github.com/docker/app/internal/cnab github.com/docker/app/internal/commands github.com/docker/app/internal/commands/build github.com/docker/app/internal/commands/image github.com/docker/app/internal/compose github.com/docker/app/internal/formatter github.com/docker/app/internal/formatter/driver github.com/docker/app/internal/formatter/json github.com/docker/app/internal/formatter/yaml github.com/docker/app/internal/inspect github.com/docker/app/internal/log github.com/docker/app/internal/packager github.com/docker/app/internal/relocated github.com/docker/app/internal/slices github.com/docker/app/internal/store github.com/docker/app/internal/yaml github.com/docker/app/loader github.com/docker/app/render github.com/docker/app/specification github.com/docker/app/types github.com/docker/app/types/metadata github.com/docker/app/types/parameters
∅  .
PASS e2e/linux.TestRelocationMapCreatedOnPull (25.18s)
PASS e2e/linux.TestRelocationMapRun/with-relocation-map (2.25s)
PASS e2e/linux.TestRelocationMapRun/without-relocation-map (0.11s)
PASS e2e/linux.TestRelocationMapRun (29.36s)
PASS e2e/linux.TestRelocationMapOnInspect (26.02s)
PASS e2e/linux.TestOrphanedParameter (0.09s)
PASS e2e/linux

DONE 49 tests in 416.417s
time="2019-11-08T07:58:00Z" level=warning msg="failed to lookup go version for junit xml" error="exec: \"go\": executable file not found in $PATH"
[Pipeline] }
[Pipeline] // ansiColor
[Pipeline] }
[Pipeline] // dir
Post stage
[Pipeline] archiveArtifacts
Archiving artifacts
Uploaded 1 artifact(s) to https://corp-us-east-1-jenkins-k8s-maste-jenkinsartifacts-1lzm7adht5e1j.s3.amazonaws.com/public/app/PR-719/38/artifacts/
[Pipeline] junit
Recording test results
[Pipeline] sh
+ docker rmi docker/cnab-app-base:jenkins-app-PR-719-38
Untagged: docker/cnab-app-base:jenkins-app-PR-719-38
[Pipeline] deleteDir
[Pipeline] }
[Pipeline] // withEnv
[Pipeline] }
[Pipeline] // node
[Pipeline] }
[Pipeline] // stage
[Pipeline] }
∅  cmd/cnab-run
∅  cmd/docker-app
∅  docs/yaml
✓  internal (25ms)
✓  internal/bundle (46ms)
∅  internal/cliopts
✓  internal/cnab (19ms)
✓  internal/commands (445ms)
✓  internal/commands/build (74ms)
✓  internal/commands/image (19ms)
✓  internal/compose (4ms)
✓  internal/formatter (3ms)
∅  internal/formatter/driver
∅  internal/formatter/json
∅  internal/formatter/yaml
✓  internal/inspect (180ms)
∅  internal/log
✓  internal/packager (60ms)
∅  internal/relocated
✓  internal/slices (8ms)
✓  internal/yaml (11ms)
✓  internal/store (55ms)
✓  loader (57ms)
✓  render (99ms)
✓  specification (12ms)
✓  types (39ms)
✓  types/metadata (34ms)
✓  types/parameters (4ms)

DONE 240 tests in 120.752s
CGO_ENABLED=0 go test -tags=" testrunmain" -ldflags="-s -w -X github.com/docker/app/internal.GitCommit=493501a1 -X github.com/docker/app/internal.Version=jenkins-app-PR-719-38-coverage -X github.com/docker/app/internal.BuildTime=2019-11-08T07:56:52Z" -coverpkg="./..." -c -o _build/docker-app.cov ./cmd/docker-app
Running e2e tests (coverage)...
DOCKERAPP_BINARY=../e2e/coverage-bin CGO_ENABLED=0 gotestsum --junitfile _build/test-results/e2e-coverage.xml -- -tags= -ldflags="-s -w -X github.com/docker/app/internal.GitCommit=493501a1 -X github.com/docker/app/internal.Version=jenkins-app-PR-719-38-coverage -X github.com/docker/app/internal.BuildTime=2019-11-08T07:56:52Z" -v ./e2e 
✓  e2e (7m1.051s)

DONE 49 tests in 424.449s
sed: can't read /^coverage/d: No such file or directory
Fixing coverage files...
go install ./vendor/github.com/wadey/gocovmerge/
gocovmerge _build/cov/*.out > _build/cov/all.out
2019/11/08 08:06:05 failed to parse profiles: line "coverage: 26.7% of statements in ./..." doesn't match expected format: ^(.+):([0-9]+).([0-9]+),([0-9]+).([0-9]+) ([0-9]+) ([0-9]+)$
make: *** [Makefile:102: coverage] Error 1
docker.Makefile:79: recipe for target 'coverage-run' failed
make: *** [coverage-run] Error 2
[Pipeline] }
[Pipeline] // ansiColor
[Pipeline] }
[Pipeline] // dir
Post stage
[Pipeline] dir
Running in /home/ubuntu/workspace/app_PR-719/src/github.com/docker/app/_build/test-results
[Pipeline] {
[Pipeline] sh
+ [ ! -e unit-coverage.xml ]
[Pipeline] sh
+ [ ! -e e2e-coverage.xml ]
[Pipeline] archiveArtifacts
Archiving artifacts
[Pipeline] junit
Recording test results
No test report files were found. Configuration error?
[Pipeline] }
[Pipeline] // dir
Error when executing always post condition:
hudson.AbortException: No test report files were found. Configuration error?
	at hudson.tasks.junit.JUnitParser$ParseResultCallable.invoke(JUnitParser.java:154)
	at hudson.tasks.junit.JUnitParser$ParseResultCallable.invoke(JUnitParser.java:118)
	at hudson.FilePath$FileCallableWrapper.call(FilePath.java:3050)
	at hudson.remoting.UserRequest.perform(UserRequest.java:212)
	at hudson.remoting.UserRequest.perform(UserRequest.java:54)
	at hudson.remoting.Request$2.run(Request.java:369)
	at hudson.remoting.InterceptingExecutorService$1.call(InterceptingExecutorService.java:72)
	at java.util.concurrent.FutureTask.run(FutureTask.java:264)
	at java.util.concurrent.ThreadPoolExecutor.runWorker(ThreadPoolExecutor.java:1128)
	at java.util.concurrent.ThreadPoolExecutor$Worker.run(ThreadPoolExecutor.java:628)
	at java.lang.Thread.run(Thread.java:834)
	Suppressed: hudson.remoting.Channel$CallSiteStackTrace: Remote call to ubuntu-1804-overlay2 (i-02676d5538229dc84)
		at hudson.remoting.Channel.attachCallSiteStackTrace(Channel.java:1743)
		at hudson.remoting.UserRequest$ExceptionResponse.retrieve(UserRequest.java:357)
		at hudson.remoting.Channel.call(Channel.java:957)
		at hudson.FilePath.act(FilePath.java:1070)
		at hudson.FilePath.act(FilePath.java:1059)
		at hudson.tasks.junit.JUnitParser.parseResult(JUnitParser.java:114)
		at hudson.tasks.junit.JUnitResultArchiver.parse(JUnitResultArchiver.java:137)
		at hudson.tasks.junit.JUnitResultArchiver.parseAndAttach(JUnitResultArchiver.java:167)
		at hudson.tasks.junit.pipeline.JUnitResultsStepExecution.run(JUnitResultsStepExecution.java:52)
		at hudson.tasks.junit.pipeline.JUnitResultsStepExecution.run(JUnitResultsStepExecution.java:25)
		at org.jenkinsci.plugins.workflow.steps.SynchronousNonBlockingStepExecution.lambda$start$0(SynchronousNonBlockingStepExecution.java:47)
		at java.util.concurrent.Executors$RunnableAdapter.call(Executors.java:511)
		at java.util.concurrent.FutureTask.run(FutureTask.java:266)
		at java.util.concurrent.ThreadPoolExecutor.runWorker(ThreadPoolExecutor.java:1149)
		at java.util.concurrent.ThreadPoolExecutor$Worker.run(ThreadPoolExecutor.java:624)
		at java.lang.Thread.run(Thread.java:748)

[Pipeline] }
[Pipeline] // node
[Pipeline] }
[Pipeline] // stage
[Pipeline] }
Failed in branch Coverage
[Pipeline] // parallel
[Pipeline] }
[Pipeline] // stage
[Pipeline] }
[Pipeline] // timeout
[Pipeline] }
[Pipeline] // withEnv
[Pipeline] End of Pipeline

GitHub has been notified of this commit’s build result

ERROR: script returned exit code 2
Finished: FAILURE