Skip to content
Failed

Console Output

Pull request #801 updated
14:01:18 Connecting to https://api.github.com using docker-jenkins/****** (docker-jenkins GitHub credentials)
Obtained Jenkinsfile from a1df96ab25d6865347105ee6d72cbfe6a046d40f
Running in Durability level: PERFORMANCE_OPTIMIZED
Loading library jps@master
Examining docker/jps
Attempting to resolve master as a branch
Resolved master as branch master at revision 241f6703d31895690d4cb6f158f753615abe74ac
using credential jps-reader
 > git rev-parse --is-inside-work-tree # timeout=10
Fetching changes from the remote Git repository
 > git config remote.origin.url https://github.com/docker/jps.git # timeout=10
Fetching without tags
Fetching upstream changes from https://github.com/docker/jps.git
 > git --version # timeout=10
using GIT_ASKPASS to set credentials GitHub credentials for docker/jps
 > git fetch --no-tags --force --progress -- https://github.com/docker/jps.git +refs/heads/master:refs/remotes/origin/master # timeout=10
Checking out Revision 241f6703d31895690d4cb6f158f753615abe74ac (master)
 > git config core.sparsecheckout # timeout=10
 > git checkout -f 241f6703d31895690d4cb6f158f753615abe74ac # timeout=10
Commit message: "Merge pull request #21 from docker/use-multiarch-busybox"
 > git rev-list --no-walk 241f6703d31895690d4cb6f158f753615abe74ac # timeout=10
[Pipeline] Start of Pipeline
[Pipeline] withEnv
[Pipeline] {
[Pipeline] timeout
Timeout set to expire in 1 hr 0 min
[Pipeline] {
[Pipeline] stage
[Pipeline] { (Build)
[Pipeline] parallel
[Pipeline] { (Branch: Validate)
[Pipeline] { (Branch: Binaries)
[Pipeline] { (Branch: Build Invocation image)
[Pipeline] stage
[Pipeline] { (Validate)
[Pipeline] stage
[Pipeline] { (Binaries)
[Pipeline] stage
[Pipeline] { (Build Invocation image)
[Pipeline] node
[Pipeline] node
[Pipeline] node
Running on EC2 (managed-agents) - ubuntu-1804-overlay2 (i-0d550038ee050e1d9) in /home/ubuntu/workspace/app_PR-801
[Pipeline] {
Running on EC2 (managed-agents) - ubuntu-1804-overlay2 (i-089bbfbbf76f335e0) in /home/ubuntu/workspace/app_PR-801
[Pipeline] {
Running on EC2 (managed-agents) - ubuntu-1804-overlay2 (i-069967addd72046be) in /home/ubuntu/workspace/app_PR-801
[Pipeline] {
[Pipeline] dir
Running in /home/ubuntu/workspace/app_PR-801/src/github.com/docker/app
[Pipeline] {
[Pipeline] dir
Running in /home/ubuntu/workspace/app_PR-801/src/github.com/docker/app
[Pipeline] {
[Pipeline] script
[Pipeline] {
[Pipeline] dir
Running in /home/ubuntu/workspace/app_PR-801/src/github.com/docker/app
[Pipeline] {
[Pipeline] checkout
[Pipeline] checkout
using credential docker-jenkins-github-credentials
[Pipeline] checkout
using credential docker-jenkins-github-credentials
Cloning the remote Git repository
Cloning with configured refspecs honoured and without tags
using credential docker-jenkins-github-credentials
Cloning the remote Git repository
Cloning with configured refspecs honoured and without tags
Cloning the remote Git repository
Cloning with configured refspecs honoured and without tags
Cloning repository https://github.com/docker/app.git
 > git init /home/ubuntu/workspace/app_PR-801/src/github.com/docker/app # timeout=10
Fetching upstream changes from https://github.com/docker/app.git
 > git --version # timeout=10
using GIT_ASKPASS to set credentials docker-jenkins GitHub credentials
 > git fetch --no-tags --progress -- https://github.com/docker/app.git +refs/pull/801/head:refs/remotes/origin/PR-801 # timeout=10
Cloning repository https://github.com/docker/app.git
 > git init /home/ubuntu/workspace/app_PR-801/src/github.com/docker/app # timeout=10
Fetching upstream changes from https://github.com/docker/app.git
 > git --version # timeout=10
using GIT_ASKPASS to set credentials docker-jenkins GitHub credentials
 > git fetch --no-tags --progress -- https://github.com/docker/app.git +refs/pull/801/head:refs/remotes/origin/PR-801 # timeout=10
Cloning repository https://github.com/docker/app.git
 > git init /home/ubuntu/workspace/app_PR-801/src/github.com/docker/app # timeout=10
Fetching upstream changes from https://github.com/docker/app.git
 > git --version # timeout=10
using GIT_ASKPASS to set credentials docker-jenkins GitHub credentials
 > git fetch --no-tags --progress -- https://github.com/docker/app.git +refs/pull/801/head:refs/remotes/origin/PR-801 # timeout=10
Fetching without tags
Checking out Revision a1df96ab25d6865347105ee6d72cbfe6a046d40f (PR-801)
Commit message: "Fix linter timeout: add some concurrency and tweak the garbage collector Fix linter errors"
First time build. Skipping changelog.
 > git config remote.origin.url https://github.com/docker/app.git # timeout=10
 > git config --add remote.origin.fetch +refs/pull/801/head:refs/remotes/origin/PR-801 # timeout=10
 > git config remote.origin.url https://github.com/docker/app.git # timeout=10
Fetching upstream changes from https://github.com/docker/app.git
using GIT_ASKPASS to set credentials docker-jenkins GitHub credentials
 > git fetch --no-tags --progress -- https://github.com/docker/app.git +refs/pull/801/head:refs/remotes/origin/PR-801 # timeout=10
 > git config core.sparsecheckout # timeout=10
 > git checkout -f a1df96ab25d6865347105ee6d72cbfe6a046d40f # timeout=10
 > git rev-list --no-walk 2150f8252654e6b9e2055dce9b2e7928265c1ed2 # timeout=10
[Pipeline] ansiColor
[Pipeline] {
[Pipeline] sh
+ make -f docker.Makefile invocation-image save-invocation-image
docker build -f Dockerfile.invocation-image --build-arg TAG=jenkins-app-PR-801-6 --build-arg COMMIT=a1df96ab --build-arg ALPINE_VERSION=3.11.5 --build-arg GOPROXY=direct --target=invocation -t docker/cnab-app-base:jenkins-app-PR-801-6 -t docker/cnab-app-base:jenkins-app-PR-801-6-amd64 --platform=amd64 .
#2 [internal] load build definition from Dockerfile.invocation-image
#2 transferring dockerfile: 615B done
#2 DONE 0.0s

#1 [internal] load .dockerignore
#1 transferring context: 73B done
#1 DONE 0.0s

#4 [internal] load metadata for docker.io/library/alpine:3.11.5
#4 DONE 0.3s

#3 [internal] load metadata for docker.io/library/golang:1.13.10
#3 DONE 0.3s

#7 [build 1/5] FROM docker.io/library/golang:1.13.10@sha256:81bd18af9605d1a...
#7 resolve docker.io/library/golang:1.13.10@sha256:81bd18af9605d1a47d48cf71b6864c7aafb764330b8439f53140114e1387282f done
#7 sha256:09b6f03ffac4cb4e42f8ab0bfc480bd3a3fa20e1ddee37784db63bc886b0cbb3 0B / 7.81MB 0.1s
#7 sha256:dc3f0c679f0f4c39597721c1df5cdb4f9685b26bd789a44eeb406835a1800d5f 191.02kB / 10.00MB 0.1s
#7 sha256:8e16241796906ead8363ffeb21ecf8cf9df4bff224ee6f54f76b2274b1d34b32 1.79kB / 1.79kB done
#7 sha256:f0d185e111f66f303a7fda933895d6ef09440c2a396dc3c544458fea4c2954b3 5.46kB / 5.46kB done
#7 sha256:7e2b2a5af8f65687add6d864d5841067e23bd435eb1a051be6fe1ea2384946b4 382.50kB / 50.38MB 0.1s
#7 sha256:81bd18af9605d1a47d48cf71b6864c7aafb764330b8439f53140114e1387282f 1.91kB / 1.91kB done
#7 sha256:09b6f03ffac4cb4e42f8ab0bfc480bd3a3fa20e1ddee37784db63bc886b0cbb3 3.43MB / 7.81MB 0.2s
#7 sha256:dc3f0c679f0f4c39597721c1df5cdb4f9685b26bd789a44eeb406835a1800d5f 10.00MB / 10.00MB 0.2s
#7 sha256:7e2b2a5af8f65687add6d864d5841067e23bd435eb1a051be6fe1ea2384946b4 4.40MB / 50.38MB 0.2s
#7 sha256:09b6f03ffac4cb4e42f8ab0bfc480bd3a3fa20e1ddee37784db63bc886b0cbb3 7.81MB / 7.81MB 0.3s done
#7 sha256:dc3f0c679f0f4c39597721c1df5cdb4f9685b26bd789a44eeb406835a1800d5f 10.00MB / 10.00MB 0.2s done
#7 sha256:7e2b2a5af8f65687add6d864d5841067e23bd435eb1a051be6fe1ea2384946b4 11.55MB / 50.38MB 0.3s
#7 sha256:fd4b47407fc30b8206971ec60f280b107b00df8007da2fb912ebb8656b53695e 0B / 51.83MB 0.3s
#7 sha256:836e4bd1f6034f90e2b7000a6588d17effcc76a071de189816037763bd6d5116 0B / 68.61MB 0.3s
#7 sha256:7e2b2a5af8f65687add6d864d5841067e23bd435eb1a051be6fe1ea2384946b4 18.24MB / 50.38MB 0.4s
#7 sha256:836e4bd1f6034f90e2b7000a6588d17effcc76a071de189816037763bd6d5116 5.86MB / 68.61MB 0.4s
#7 sha256:7e2b2a5af8f65687add6d864d5841067e23bd435eb1a051be6fe1ea2384946b4 40.70MB / 50.38MB 0.6s
#7 sha256:836e4bd1f6034f90e2b7000a6588d17effcc76a071de189816037763bd6d5116 22.25MB / 68.61MB 0.6s
#7 sha256:7e2b2a5af8f65687add6d864d5841067e23bd435eb1a051be6fe1ea2384946b4 48.98MB / 50.38MB 0.7s
#7 sha256:fd4b47407fc30b8206971ec60f280b107b00df8007da2fb912ebb8656b53695e 8.20MB / 51.83MB 0.7s
#7 sha256:836e4bd1f6034f90e2b7000a6588d17effcc76a071de189816037763bd6d5116 26.84MB / 68.61MB 0.7s
#7 sha256:fd4b47407fc30b8206971ec60f280b107b00df8007da2fb912ebb8656b53695e 12.54MB / 51.83MB 0.8s
#7 sha256:836e4bd1f6034f90e2b7000a6588d17effcc76a071de189816037763bd6d5116 34.52MB / 68.61MB 0.8s
#7 sha256:7e2b2a5af8f65687add6d864d5841067e23bd435eb1a051be6fe1ea2384946b4 50.38MB / 50.38MB 0.8s done
#7 sha256:fd4b47407fc30b8206971ec60f280b107b00df8007da2fb912ebb8656b53695e 18.07MB / 51.83MB 0.9s
#7 sha256:836e4bd1f6034f90e2b7000a6588d17effcc76a071de189816037763bd6d5116 41.78MB / 68.61MB 0.9s
#7 sha256:0e932c33d0d62128198fdaf6dcb2f71fda2f7d2450276a0fab6657dba7c5eb4f 0B / 120.15MB 0.9s
#7 sha256:fd4b47407fc30b8206971ec60f280b107b00df8007da2fb912ebb8656b53695e 31.30MB / 51.83MB 1.1s
#7 sha256:836e4bd1f6034f90e2b7000a6588d17effcc76a071de189816037763bd6d5116 50.05MB / 68.61MB 1.1s
#7 sha256:0e932c33d0d62128198fdaf6dcb2f71fda2f7d2450276a0fab6657dba7c5eb4f 15.96MB / 120.15MB 1.1s
#7 extracting sha256:7e2b2a5af8f65687add6d864d5841067e23bd435eb1a051be6fe1ea2384946b4
#7 sha256:fd4b47407fc30b8206971ec60f280b107b00df8007da2fb912ebb8656b53695e 34.52MB / 51.83MB 1.2s
#7 sha256:fd4b47407fc30b8206971ec60f280b107b00df8007da2fb912ebb8656b53695e 39.01MB / 51.83MB 1.3s
#7 sha256:836e4bd1f6034f90e2b7000a6588d17effcc76a071de189816037763bd6d5116 62.15MB / 68.61MB 1.3s
#7 sha256:0e932c33d0d62128198fdaf6dcb2f71fda2f7d2450276a0fab6657dba7c5eb4f 25.41MB / 120.15MB 1.3s
#7 sha256:fd4b47407fc30b8206971ec60f280b107b00df8007da2fb912ebb8656b53695e 44.34MB / 51.83MB 1.4s
#7 sha256:836e4bd1f6034f90e2b7000a6588d17effcc76a071de189816037763bd6d5116 68.61MB / 68.61MB 1.4s
#7 sha256:fd4b47407fc30b8206971ec60f280b107b00df8007da2fb912ebb8656b53695e 51.83MB / 51.83MB 1.6s done
#7 sha256:836e4bd1f6034f90e2b7000a6588d17effcc76a071de189816037763bd6d5116 68.61MB / 68.61MB 1.5s done
#7 sha256:0e932c33d0d62128198fdaf6dcb2f71fda2f7d2450276a0fab6657dba7c5eb4f 48.03MB / 120.15MB 1.7s
#7 sha256:661a1e4b9bc95b5c88b4741aab8cadf291d836a0b8ddda88464d3f54676c850c 125B / 125B 1.6s done
#7 sha256:0e932c33d0d62128198fdaf6dcb2f71fda2f7d2450276a0fab6657dba7c5eb4f 59.55MB / 120.15MB 1.9s
#7 sha256:0e932c33d0d62128198fdaf6dcb2f71fda2f7d2450276a0fab6657dba7c5eb4f 67.31MB / 120.15MB 2.0s
#7 sha256:0e932c33d0d62128198fdaf6dcb2f71fda2f7d2450276a0fab6657dba7c5eb4f 73.76MB / 120.15MB 2.1s
#7 sha256:0e932c33d0d62128198fdaf6dcb2f71fda2f7d2450276a0fab6657dba7c5eb4f 80.40MB / 120.15MB 2.2s
#7 ...

#5 [invocation 1/4] FROM docker.io/library/alpine:3.11.5@sha256:b276d875eee...
#5 resolve docker.io/library/alpine:3.11.5@sha256:b276d875eeed9c7d3f1cfa7edb06b22ed22b14219a7d67c52c56612330348239 done
#5 sha256:a187dde48cd289ac374ad8539930628314bc581a481cdb41409c9289419ddb72 1.51kB / 1.51kB done
#5 sha256:b276d875eeed9c7d3f1cfa7edb06b22ed22b14219a7d67c52c56612330348239 1.64kB / 1.64kB done
#5 sha256:cb8a924afdf0229ef7515d9e5b3024e23b3eb03ddbba287f4a19c6ac90b8d221 528B / 528B done
#5 sha256:aad63a9339440e7c3e1fff2b988991b9bfb81280042fa7f39a5e327023056819 2.80MB / 2.80MB 1.7s done
#5 extracting sha256:aad63a9339440e7c3e1fff2b988991b9bfb81280042fa7f39a5e327023056819 0.4s done
#5 DONE 2.3s

#7 [build 1/5] FROM docker.io/library/golang:1.13.10@sha256:81bd18af9605d1a...
#7 sha256:0e932c33d0d62128198fdaf6dcb2f71fda2f7d2450276a0fab6657dba7c5eb4f 94.94MB / 120.15MB 2.4s
#7 sha256:0e932c33d0d62128198fdaf6dcb2f71fda2f7d2450276a0fab6657dba7c5eb4f 105.83MB / 120.15MB 2.6s
#7 sha256:0e932c33d0d62128198fdaf6dcb2f71fda2f7d2450276a0fab6657dba7c5eb4f 115.21MB / 120.15MB 2.7s
#7 sha256:0e932c33d0d62128198fdaf6dcb2f71fda2f7d2450276a0fab6657dba7c5eb4f 120.15MB / 120.15MB 2.9s done
Fetching without tags
Fetching without tags
Checking out Revision a1df96ab25d6865347105ee6d72cbfe6a046d40f (PR-801)
Checking out Revision a1df96ab25d6865347105ee6d72cbfe6a046d40f (PR-801)
Commit message: "Fix linter timeout: add some concurrency and tweak the garbage collector Fix linter errors"
Commit message: "Fix linter timeout: add some concurrency and tweak the garbage collector Fix linter errors"
 > git config remote.origin.url https://github.com/docker/app.git # timeout=10
 > git config --add remote.origin.fetch +refs/pull/801/head:refs/remotes/origin/PR-801 # timeout=10
 > git config remote.origin.url https://github.com/docker/app.git # timeout=10
Fetching upstream changes from https://github.com/docker/app.git
using GIT_ASKPASS to set credentials docker-jenkins GitHub credentials
 > git fetch --no-tags --progress -- https://github.com/docker/app.git +refs/pull/801/head:refs/remotes/origin/PR-801 # timeout=10
 > git config core.sparsecheckout # timeout=10
 > git checkout -f a1df96ab25d6865347105ee6d72cbfe6a046d40f # timeout=10
 > git config remote.origin.url https://github.com/docker/app.git # timeout=10
 > git config --add remote.origin.fetch +refs/pull/801/head:refs/remotes/origin/PR-801 # timeout=10
 > git config remote.origin.url https://github.com/docker/app.git # timeout=10
Fetching upstream changes from https://github.com/docker/app.git
using GIT_ASKPASS to set credentials docker-jenkins GitHub credentials
 > git fetch --no-tags --progress -- https://github.com/docker/app.git +refs/pull/801/head:refs/remotes/origin/PR-801 # timeout=10
 > git config core.sparsecheckout # timeout=10
 > git checkout -f a1df96ab25d6865347105ee6d72cbfe6a046d40f # timeout=10
#7 ...

#10 [internal] load build context
#10 transferring context: 80.86MB 4.5s done
#10 DONE 4.5s

#7 [build 1/5] FROM docker.io/library/golang:1.13.10@sha256:81bd18af9605d1a...
[Pipeline] ansiColor
[Pipeline] {
[Pipeline] sh
[Pipeline] ansiColor
[Pipeline] {
[Pipeline] sh
+ make -f docker.Makefile cli-cross cross e2e-cross tars
docker build --build-arg TAG=jenkins-app-PR-801-6 --build-arg COMMIT=a1df96ab --build-arg ALPINE_VERSION=3.11.5 --build-arg GOPROXY=direct --output type=local,dest=./bin/ --target=cli -t docker-app-cli:jenkins-app-PR-801-6 .
#1 [internal] load .dockerignore
#1 transferring context: 73B done
#1 DONE 0.0s

#2 [internal] load build definition from Dockerfile
#2 transferring dockerfile: 4.75kB done
#2 DONE 0.0s

#3 [internal] load metadata for docker.io/dockercore/golang-cross:1.13.10@s...
+ make -f docker.Makefile lint
Linting...
docker build -t docker-app-lint:jenkins-app-PR-801-6 -f Dockerfile.lint .
#2 [internal] load .dockerignore
#2 transferring context: 73B done
#2 DONE 0.0s

#1 [internal] load build definition from Dockerfile.lint
#1 transferring dockerfile: 432B done
#1 DONE 0.0s

#3 [internal] load metadata for docker.io/library/golang:1.13.10-alpine3.11
#3 DONE 0.2s

#4 [cli-build 1/10] FROM docker.io/dockercore/golang-cross:1.13.10@sha256:a...
#4 resolve docker.io/dockercore/golang-cross:1.13.10@sha256:ad2725ac9af0273f1de9bb85e166084d5e8d915df334154fe9c8bd9af912a90d done
#4 sha256:ad2725ac9af0273f1de9bb85e166084d5e8d915df334154fe9c8bd9af912a90d 2.85kB / 2.85kB done
#4 sha256:39e7d24d0bf423ddd560a4179fcf2056719a98b730f0cef92e8ddfb142fc026f 7.91kB / 7.91kB done
#4 sha256:b998346ba308e3362a85c7bf7faed28d0277c68203696134192fe812f809abb2 939.56kB / 10.00MB 0.1s
#4 sha256:41ebfd3d2fd0de99b1c63aa36a507bf5555481d06e571d84ed84440d30671494 4.91MB / 7.81MB 0.1s
#4 sha256:f15005b0235fa8bd31cc6988c4f2758016fe412d696e81aecf73e52be079f19e 0B / 50.38MB 0.1s
#3 DONE 0.3s

#4 [1/5] FROM docker.io/library/golang:1.13.10-alpine3.11@sha256:84a409b4c1...
#4 resolve docker.io/library/golang:1.13.10-alpine3.11@sha256:84a409b4c174965a51e393064e46f6eb32adb80daa6097851268458136fd68b6 done
#4 sha256:84a409b4c174965a51e393064e46f6eb32adb80daa6097851268458136fd68b6 1.65kB / 1.65kB done
#4 sha256:c036cd76f7c49d77e3fb960854076ec537524f89bb0c99d73e5945b68e08a011 1.36kB / 1.36kB done
#4 sha256:3369136a43d197814f14414bf7112e8ddebd23c5bf787dd14dc3f078bad90dae 3.83kB / 3.83kB done
#4 sha256:aad63a9339440e7c3e1fff2b988991b9bfb81280042fa7f39a5e327023056819 1.55MB / 2.80MB 0.1s
#4 sha256:c732a2540651eb09faab95b03b3b5928ab23e096fae0006bdc2abf9e0cb5bfb4 0B / 301.28kB 0.1s
#4 sha256:7b2225181d6bcfb7877529a7257ff207cb14e52831420f770cbc2187031b6228 0B / 153B 0.1s
#4 sha256:b998346ba308e3362a85c7bf7faed28d0277c68203696134192fe812f809abb2 10.00MB / 10.00MB 0.1s done
#4 sha256:41ebfd3d2fd0de99b1c63aa36a507bf5555481d06e571d84ed84440d30671494 7.81MB / 7.81MB 0.1s done
#4 sha256:f15005b0235fa8bd31cc6988c4f2758016fe412d696e81aecf73e52be079f19e 3.22MB / 50.38MB 0.2s
#4 sha256:c5e092b8639b2b26d0a0604afc0365727825677987fcb3bcab945a793ae99e0e 0B / 68.60MB 0.2s
#4 sha256:f01ec562c947a8ca1b168415da6a4a8f8920808f9b5d6f420ef8fa9af249b1f1 0B / 51.79MB 0.2s
#4 sha256:f15005b0235fa8bd31cc6988c4f2758016fe412d696e81aecf73e52be079f19e 10.53MB / 50.38MB 0.3s
#4 sha256:c5e092b8639b2b26d0a0604afc0365727825677987fcb3bcab945a793ae99e0e 5.08MB / 68.60MB 0.3s
#4 sha256:f01ec562c947a8ca1b168415da6a4a8f8920808f9b5d6f420ef8fa9af249b1f1 5.50MB / 51.79MB 0.3s
#4 extracting sha256:aad63a9339440e7c3e1fff2b988991b9bfb81280042fa7f39a5e327023056819
#4 sha256:aad63a9339440e7c3e1fff2b988991b9bfb81280042fa7f39a5e327023056819 2.80MB / 2.80MB 0.1s done
#4 sha256:c732a2540651eb09faab95b03b3b5928ab23e096fae0006bdc2abf9e0cb5bfb4 301.28kB / 301.28kB 0.1s done
#4 sha256:7b2225181d6bcfb7877529a7257ff207cb14e52831420f770cbc2187031b6228 153B / 153B 0.1s done
#4 sha256:5871566633bc6faf1b0e52c1712830bcc8ef24b9b6dddc4fdf9f24f1d0b257ef 124B / 124B 0.2s done
#4 sha256:c7df7edfcd79ac418cc9ba54ef1f1952a55fd6dd98a9e1082dd0d0af00d28c7a 2.99MB / 126.95MB 0.2s
#4 sha256:f15005b0235fa8bd31cc6988c4f2758016fe412d696e81aecf73e52be079f19e 17.77MB / 50.38MB 0.4s
#4 sha256:c5e092b8639b2b26d0a0604afc0365727825677987fcb3bcab945a793ae99e0e 15.74MB / 68.60MB 0.4s
#4 sha256:f01ec562c947a8ca1b168415da6a4a8f8920808f9b5d6f420ef8fa9af249b1f1 11.63MB / 51.79MB 0.4s
#4 sha256:f15005b0235fa8bd31cc6988c4f2758016fe412d696e81aecf73e52be079f19e 27.64MB / 50.38MB 0.5s
#4 sha256:c5e092b8639b2b26d0a0604afc0365727825677987fcb3bcab945a793ae99e0e 23.43MB / 68.60MB 0.5s
#4 sha256:f01ec562c947a8ca1b168415da6a4a8f8920808f9b5d6f420ef8fa9af249b1f1 16.96MB / 51.79MB 0.5s
#4 sha256:c7df7edfcd79ac418cc9ba54ef1f1952a55fd6dd98a9e1082dd0d0af00d28c7a 19.17MB / 126.95MB 0.4s
#4 sha256:c7df7edfcd79ac418cc9ba54ef1f1952a55fd6dd98a9e1082dd0d0af00d28c7a 27.93MB / 126.95MB 0.5s
#4 extracting sha256:aad63a9339440e7c3e1fff2b988991b9bfb81280042fa7f39a5e327023056819 0.5s done
#4 sha256:c7df7edfcd79ac418cc9ba54ef1f1952a55fd6dd98a9e1082dd0d0af00d28c7a 37.47MB / 126.95MB 0.6s
#7 extracting sha256:7e2b2a5af8f65687add6d864d5841067e23bd435eb1a051be6fe1ea2384946b4 4.6s done
#7 ...

#6 [invocation 2/4] RUN apk add --no-cache ca-certificates && adduser -S cn...
#6 1.408 fetch http://dl-cdn.alpinelinux.org/alpine/v3.11/main/x86_64/APKINDEX.tar.gz
#6 2.495 fetch http://dl-cdn.alpinelinux.org/alpine/v3.11/community/x86_64/APKINDEX.tar.gz
#6 2.629 (1/1) Installing ca-certificates (20191127-r1)
#6 2.655 Executing busybox-1.31.1-r9.trigger
#6 2.658 Executing ca-certificates-20191127-r1.trigger
#6 2.705 OK: 6 MiB in 15 packages
#6 DONE 3.5s

#7 [build 1/5] FROM docker.io/library/golang:1.13.10@sha256:81bd18af9605d1a...
#7 extracting sha256:09b6f03ffac4cb4e42f8ab0bfc480bd3a3fa20e1ddee37784db63bc886b0cbb3
#4 sha256:f15005b0235fa8bd31cc6988c4f2758016fe412d696e81aecf73e52be079f19e 34.45MB / 50.38MB 0.6s
#4 sha256:c5e092b8639b2b26d0a0604afc0365727825677987fcb3bcab945a793ae99e0e 28.18MB / 68.60MB 0.6s
#4 sha256:f01ec562c947a8ca1b168415da6a4a8f8920808f9b5d6f420ef8fa9af249b1f1 27.23MB / 51.79MB 0.6s
#4 sha256:f15005b0235fa8bd31cc6988c4f2758016fe412d696e81aecf73e52be079f19e 49.21MB / 50.38MB 0.8s
#4 sha256:c5e092b8639b2b26d0a0604afc0365727825677987fcb3bcab945a793ae99e0e 36.61MB / 68.60MB 0.8s
#4 sha256:f01ec562c947a8ca1b168415da6a4a8f8920808f9b5d6f420ef8fa9af249b1f1 41.02MB / 51.79MB 0.8s
#4 sha256:c7df7edfcd79ac418cc9ba54ef1f1952a55fd6dd98a9e1082dd0d0af00d28c7a 59.42MB / 126.95MB 0.9s
#4 extracting sha256:c732a2540651eb09faab95b03b3b5928ab23e096fae0006bdc2abf9e0cb5bfb4
#4 sha256:f15005b0235fa8bd31cc6988c4f2758016fe412d696e81aecf73e52be079f19e 50.38MB / 50.38MB 0.9s done
#4 sha256:c5e092b8639b2b26d0a0604afc0365727825677987fcb3bcab945a793ae99e0e 50.27MB / 68.60MB 1.0s
#4 sha256:f01ec562c947a8ca1b168415da6a4a8f8920808f9b5d6f420ef8fa9af249b1f1 51.79MB / 51.79MB 0.9s done
#4 sha256:4feb95896f3c7a0fd4c4b42dd7419eb5857133919137ae19e7f889243c2e329d 0B / 120.15MB 1.0s
#4 sha256:c7b88469670a8ad543aff31d4eca30e2985f84fcf5db46d6710885672cc438b6 0B / 126B 1.0s
#4 sha256:c5e092b8639b2b26d0a0604afc0365727825677987fcb3bcab945a793ae99e0e 62.13MB / 68.60MB 1.1s
#4 sha256:c7b88469670a8ad543aff31d4eca30e2985f84fcf5db46d6710885672cc438b6 126B / 126B 1.0s done
#4 sha256:ff08e1e3892413cf1db5c7bb4ef561221a982ae8c351691642192fbaa6606691 0B / 269B 1.1s
#4 extracting sha256:f15005b0235fa8bd31cc6988c4f2758016fe412d696e81aecf73e52be079f19e
#4 sha256:c5e092b8639b2b26d0a0604afc0365727825677987fcb3bcab945a793ae99e0e 68.60MB / 68.60MB 1.2s
#4 sha256:4feb95896f3c7a0fd4c4b42dd7419eb5857133919137ae19e7f889243c2e329d 10.26MB / 120.15MB 1.2s
#4 sha256:ff08e1e3892413cf1db5c7bb4ef561221a982ae8c351691642192fbaa6606691 269B / 269B 1.1s done
#4 sha256:8f48c2e5d9a18780aeec30e1221d5c8cf0a0c9e0e168f36ff96db909bd55b03d 0B / 66.09MB 1.2s
#4 sha256:c7df7edfcd79ac418cc9ba54ef1f1952a55fd6dd98a9e1082dd0d0af00d28c7a 66.58MB / 126.95MB 1.0s
#4 extracting sha256:c732a2540651eb09faab95b03b3b5928ab23e096fae0006bdc2abf9e0cb5bfb4 0.2s done
#7 extracting sha256:09b6f03ffac4cb4e42f8ab0bfc480bd3a3fa20e1ddee37784db63bc886b0cbb3 0.3s done
#7 extracting sha256:dc3f0c679f0f4c39597721c1df5cdb4f9685b26bd789a44eeb406835a1800d5f
#4 sha256:4feb95896f3c7a0fd4c4b42dd7419eb5857133919137ae19e7f889243c2e329d 16.96MB / 120.15MB 1.3s
#4 sha256:c5e092b8639b2b26d0a0604afc0365727825677987fcb3bcab945a793ae99e0e 68.60MB / 68.60MB 1.3s done
#4 sha256:8f48c2e5d9a18780aeec30e1221d5c8cf0a0c9e0e168f36ff96db909bd55b03d 4.64MB / 66.09MB 1.4s
#4 sha256:898ab219a8f792839ff6daceb49fb4e78f66601575f3b39d91c1703f139ac170 0B / 150.10MB 1.4s
#4 sha256:c7df7edfcd79ac418cc9ba54ef1f1952a55fd6dd98a9e1082dd0d0af00d28c7a 79.65MB / 126.95MB 1.2s
#4 extracting sha256:7b2225181d6bcfb7877529a7257ff207cb14e52831420f770cbc2187031b6228 done
#7 extracting sha256:dc3f0c679f0f4c39597721c1df5cdb4f9685b26bd789a44eeb406835a1800d5f 0.2s done
#7 extracting sha256:fd4b47407fc30b8206971ec60f280b107b00df8007da2fb912ebb8656b53695e
#4 sha256:4feb95896f3c7a0fd4c4b42dd7419eb5857133919137ae19e7f889243c2e329d 25.44MB / 120.15MB 1.5s
#4 sha256:4feb95896f3c7a0fd4c4b42dd7419eb5857133919137ae19e7f889243c2e329d 39.36MB / 120.15MB 1.7s
#4 sha256:8f48c2e5d9a18780aeec30e1221d5c8cf0a0c9e0e168f36ff96db909bd55b03d 15.26MB / 66.09MB 1.7s
#4 sha256:c7df7edfcd79ac418cc9ba54ef1f1952a55fd6dd98a9e1082dd0d0af00d28c7a 93.06MB / 126.95MB 1.4s
#4 sha256:c7df7edfcd79ac418cc9ba54ef1f1952a55fd6dd98a9e1082dd0d0af00d28c7a 101.95MB / 126.95MB 1.5s
#4 sha256:4feb95896f3c7a0fd4c4b42dd7419eb5857133919137ae19e7f889243c2e329d 48.38MB / 120.15MB 1.8s
#4 sha256:8f48c2e5d9a18780aeec30e1221d5c8cf0a0c9e0e168f36ff96db909bd55b03d 20.78MB / 66.09MB 1.8s
#4 sha256:898ab219a8f792839ff6daceb49fb4e78f66601575f3b39d91c1703f139ac170 14.38MB / 150.10MB 1.8s
#4 sha256:8f48c2e5d9a18780aeec30e1221d5c8cf0a0c9e0e168f36ff96db909bd55b03d 26.82MB / 66.09MB 1.9s
#4 sha256:c7df7edfcd79ac418cc9ba54ef1f1952a55fd6dd98a9e1082dd0d0af00d28c7a 116.75MB / 126.95MB 1.7s
#4 sha256:c7df7edfcd79ac418cc9ba54ef1f1952a55fd6dd98a9e1082dd0d0af00d28c7a 126.95MB / 126.95MB 1.8s
#4 sha256:8f48c2e5d9a18780aeec30e1221d5c8cf0a0c9e0e168f36ff96db909bd55b03d 32.91MB / 66.09MB 2.0s
#4 sha256:898ab219a8f792839ff6daceb49fb4e78f66601575f3b39d91c1703f139ac170 25.20MB / 150.10MB 2.0s
#4 sha256:4feb95896f3c7a0fd4c4b42dd7419eb5857133919137ae19e7f889243c2e329d 57.03MB / 120.15MB 2.1s
#4 sha256:8f48c2e5d9a18780aeec30e1221d5c8cf0a0c9e0e168f36ff96db909bd55b03d 40.01MB / 66.09MB 2.1s
#4 sha256:c7df7edfcd79ac418cc9ba54ef1f1952a55fd6dd98a9e1082dd0d0af00d28c7a 126.95MB / 126.95MB 1.9s done
#4 extracting sha256:c7df7edfcd79ac418cc9ba54ef1f1952a55fd6dd98a9e1082dd0d0af00d28c7a
#4 sha256:8f48c2e5d9a18780aeec30e1221d5c8cf0a0c9e0e168f36ff96db909bd55b03d 46.24MB / 66.09MB 2.2s
#4 sha256:898ab219a8f792839ff6daceb49fb4e78f66601575f3b39d91c1703f139ac170 33.54MB / 150.10MB 2.2s
#4 sha256:4feb95896f3c7a0fd4c4b42dd7419eb5857133919137ae19e7f889243c2e329d 67.24MB / 120.15MB 2.4s
#4 sha256:8f48c2e5d9a18780aeec30e1221d5c8cf0a0c9e0e168f36ff96db909bd55b03d 59.28MB / 66.09MB 2.4s
#4 sha256:898ab219a8f792839ff6daceb49fb4e78f66601575f3b39d91c1703f139ac170 41.37MB / 150.10MB 2.4s
#4 sha256:8f48c2e5d9a18780aeec30e1221d5c8cf0a0c9e0e168f36ff96db909bd55b03d 66.09MB / 66.09MB 2.5s
#4 sha256:4feb95896f3c7a0fd4c4b42dd7419eb5857133919137ae19e7f889243c2e329d 75.84MB / 120.15MB 2.6s
#4 sha256:898ab219a8f792839ff6daceb49fb4e78f66601575f3b39d91c1703f139ac170 50.82MB / 150.10MB 2.6s
#4 ...

#8 [internal] load build context
#8 transferring context: 80.86MB 2.6s done
#8 DONE 2.6s

#4 [1/5] FROM docker.io/library/golang:1.13.10-alpine3.11@sha256:84a409b4c1...
#4 sha256:4feb95896f3c7a0fd4c4b42dd7419eb5857133919137ae19e7f889243c2e329d 92.98MB / 120.15MB 2.8s
#4 sha256:8f48c2e5d9a18780aeec30e1221d5c8cf0a0c9e0e168f36ff96db909bd55b03d 66.09MB / 66.09MB 2.6s done
#4 sha256:898ab219a8f792839ff6daceb49fb4e78f66601575f3b39d91c1703f139ac170 68.60MB / 150.10MB 2.8s
#4 sha256:a321a30e9b5a3f2509eaa322f2075f2d0643388fa6aa38a338c19c044c150d9b 125.53kB / 195.66MB 2.8s
#4 sha256:898ab219a8f792839ff6daceb49fb4e78f66601575f3b39d91c1703f139ac170 76.81MB / 150.10MB 2.9s
#4 sha256:4feb95896f3c7a0fd4c4b42dd7419eb5857133919137ae19e7f889243c2e329d 99.11MB / 120.15MB 3.0s
#4 sha256:a321a30e9b5a3f2509eaa322f2075f2d0643388fa6aa38a338c19c044c150d9b 11.71MB / 195.66MB 3.0s
#4 sha256:898ab219a8f792839ff6daceb49fb4e78f66601575f3b39d91c1703f139ac170 88.69MB / 150.10MB 3.1s
#4 sha256:4feb95896f3c7a0fd4c4b42dd7419eb5857133919137ae19e7f889243c2e329d 113.11MB / 120.15MB 3.3s
#4 sha256:898ab219a8f792839ff6daceb49fb4e78f66601575f3b39d91c1703f139ac170 105.15MB / 150.10MB 3.3s
#4 sha256:a321a30e9b5a3f2509eaa322f2075f2d0643388fa6aa38a338c19c044c150d9b 23.43MB / 195.66MB 3.3s
#4 sha256:4feb95896f3c7a0fd4c4b42dd7419eb5857133919137ae19e7f889243c2e329d 120.15MB / 120.15MB 3.4s
#7 extracting sha256:fd4b47407fc30b8206971ec60f280b107b00df8007da2fb912ebb8656b53695e 1.9s done
#4 sha256:4feb95896f3c7a0fd4c4b42dd7419eb5857133919137ae19e7f889243c2e329d 120.15MB / 120.15MB 3.5s done
#4 sha256:898ab219a8f792839ff6daceb49fb4e78f66601575f3b39d91c1703f139ac170 124.19MB / 150.10MB 3.6s
#4 sha256:a321a30e9b5a3f2509eaa322f2075f2d0643388fa6aa38a338c19c044c150d9b 41.46MB / 195.66MB 3.6s
#4 sha256:7be16483962b3813f72dd7407838db2cb62032e913e676ecfa0eb08261f48bab 0B / 38.68kB 3.6s
#4 sha256:898ab219a8f792839ff6daceb49fb4e78f66601575f3b39d91c1703f139ac170 136.93MB / 150.10MB 3.7s
#4 sha256:7be16483962b3813f72dd7407838db2cb62032e913e676ecfa0eb08261f48bab 38.68kB / 38.68kB 3.6s done
#7 extracting sha256:836e4bd1f6034f90e2b7000a6588d17effcc76a071de189816037763bd6d5116
#4 sha256:a321a30e9b5a3f2509eaa322f2075f2d0643388fa6aa38a338c19c044c150d9b 52.06MB / 195.66MB 3.8s
#4 sha256:898ab219a8f792839ff6daceb49fb4e78f66601575f3b39d91c1703f139ac170 145.29MB / 150.10MB 3.9s
#4 sha256:a321a30e9b5a3f2509eaa322f2075f2d0643388fa6aa38a338c19c044c150d9b 76.94MB / 195.66MB 4.1s
#4 sha256:898ab219a8f792839ff6daceb49fb4e78f66601575f3b39d91c1703f139ac170 150.10MB / 150.10MB 4.2s done
#4 sha256:a321a30e9b5a3f2509eaa322f2075f2d0643388fa6aa38a338c19c044c150d9b 89.32MB / 195.66MB 4.2s
#4 sha256:a321a30e9b5a3f2509eaa322f2075f2d0643388fa6aa38a338c19c044c150d9b 124.14MB / 195.66MB 4.5s
#4 sha256:a321a30e9b5a3f2509eaa322f2075f2d0643388fa6aa38a338c19c044c150d9b 135.16MB / 195.66MB 4.7s
#4 sha256:a321a30e9b5a3f2509eaa322f2075f2d0643388fa6aa38a338c19c044c150d9b 149.22MB / 195.66MB 4.9s
#4 sha256:a321a30e9b5a3f2509eaa322f2075f2d0643388fa6aa38a338c19c044c150d9b 160.52MB / 195.66MB 5.0s
#4 sha256:a321a30e9b5a3f2509eaa322f2075f2d0643388fa6aa38a338c19c044c150d9b 186.70MB / 195.66MB 5.3s
#7 extracting sha256:836e4bd1f6034f90e2b7000a6588d17effcc76a071de189816037763bd6d5116 2.0s done
#4 sha256:a321a30e9b5a3f2509eaa322f2075f2d0643388fa6aa38a338c19c044c150d9b 195.66MB / 195.66MB 5.7s done
#7 extracting sha256:0e932c33d0d62128198fdaf6dcb2f71fda2f7d2450276a0fab6657dba7c5eb4f
#4 extracting sha256:f15005b0235fa8bd31cc6988c4f2758016fe412d696e81aecf73e52be079f19e 4.8s done
#4 extracting sha256:41ebfd3d2fd0de99b1c63aa36a507bf5555481d06e571d84ed84440d30671494
#4 extracting sha256:41ebfd3d2fd0de99b1c63aa36a507bf5555481d06e571d84ed84440d30671494 0.3s done
#4 extracting sha256:b998346ba308e3362a85c7bf7faed28d0277c68203696134192fe812f809abb2
#4 extracting sha256:b998346ba308e3362a85c7bf7faed28d0277c68203696134192fe812f809abb2 0.2s done
#4 extracting sha256:f01ec562c947a8ca1b168415da6a4a8f8920808f9b5d6f420ef8fa9af249b1f1
#4 extracting sha256:c7df7edfcd79ac418cc9ba54ef1f1952a55fd6dd98a9e1082dd0d0af00d28c7a 4.3s done
#4 extracting sha256:5871566633bc6faf1b0e52c1712830bcc8ef24b9b6dddc4fdf9f24f1d0b257ef done
#4 DONE 6.7s

#5 [2/5] RUN apk add --no-cache     curl     git     make     coreutils    ...
#5 0.571 fetch http://dl-cdn.alpinelinux.org/alpine/v3.11/main/x86_64/APKINDEX.tar.gz
#5 1.638 fetch http://dl-cdn.alpinelinux.org/alpine/v3.11/community/x86_64/APKINDEX.tar.gz
#5 1.722 (1/27) Installing libgcc (9.2.0-r4)
#5 1.724 (2/27) Installing libstdc++ (9.2.0-r4)
#5 1.737 (3/27) Installing binutils (2.33.1-r0)
#5 1.805 (4/27) Installing libmagic (5.37-r1)
#5 1.824 (5/27) Installing file (5.37-r1)
#5 1.825 (6/27) Installing gmp (6.1.2-r1)
#5 1.831 (7/27) Installing isl (0.18-r0)
#5 1.845 (8/27) Installing libgomp (9.2.0-r4)
#5 1.848 (9/27) Installing libatomic (9.2.0-r4)
#5 1.849 (10/27) Installing mpfr4 (4.0.2-r1)
#5 1.854 (11/27) Installing mpc1 (1.1.0-r1)
#5 1.856 (12/27) Installing gcc (9.2.0-r4)
#4 extracting sha256:f01ec562c947a8ca1b168415da6a4a8f8920808f9b5d6f420ef8fa9af249b1f1 1.9s done
#4 extracting sha256:c5e092b8639b2b26d0a0604afc0365727825677987fcb3bcab945a793ae99e0e
#5 2.525 (13/27) Installing musl-dev (1.1.24-r2)
#5 2.596 (14/27) Installing libc-dev (0.7.2-r0)
#5 2.597 (15/27) Installing g++ (9.2.0-r4)
#5 3.024 (16/27) Installing make (4.2.1-r2)
#5 3.027 (17/27) Installing fortify-headers (1.1-r0)
#5 3.029 (18/27) Installing build-base (0.5-r1)
#5 3.030 (19/27) Installing libacl (2.2.53-r0)
#5 3.032 (20/27) Installing libattr (2.4.48-r0)
#5 3.033 (21/27) Installing coreutils (8.31-r0)
#5 3.048 (22/27) Installing nghttp2-libs (1.40.0-r0)
#5 3.051 (23/27) Installing libcurl (7.67.0-r0)
#5 3.056 (24/27) Installing curl (7.67.0-r0)
#5 3.059 (25/27) Installing expat (2.2.9-r1)
#5 3.062 (26/27) Installing pcre2 (10.34-r1)
#5 3.069 (27/27) Installing git (2.24.2-r1)
#5 3.225 Executing busybox-1.31.1-r9.trigger
#5 3.230 OK: 194 MiB in 42 packages
#7 extracting sha256:0e932c33d0d62128198fdaf6dcb2f71fda2f7d2450276a0fab6657dba7c5eb4f 3.9s done
#7 extracting sha256:661a1e4b9bc95b5c88b4741aab8cadf291d836a0b8ddda88464d3f54676c850c done
#7 DONE 15.1s

#8 [build 2/5] RUN apt-get update -qq && apt-get install -y -q --no-install...
#4 extracting sha256:c5e092b8639b2b26d0a0604afc0365727825677987fcb3bcab945a793ae99e0e 2.0s done
#4 extracting sha256:4feb95896f3c7a0fd4c4b42dd7419eb5857133919137ae19e7f889243c2e329d 0.1s
#5 DONE 5.0s

#6 [3/5] RUN GO111MODULE=on go get     github.com/golangci/golangci-lint/cm...
#6 0.603 go: finding github.com v1.24.0
#6 0.603 go: finding github.com/golangci/golangci-lint/cmd v1.24.0
#6 0.604 go: finding github.com/golangci/golangci-lint/cmd/golangci-lint v1.24.0
#6 0.604 go: finding github.com/golangci/golangci-lint v1.24.0
#6 0.604 go: finding github.com/golangci v1.24.0
#6 0.677 go: downloading github.com/golangci/golangci-lint v1.24.0
#6 1.043 go: extracting github.com/golangci/golangci-lint v1.24.0
#6 1.566 go: downloading github.com/gofrs/flock v0.0.0-20190320160742-5135e617513b
#6 1.576 go: downloading github.com/fatih/color v1.7.0
#6 1.579 go: extracting github.com/gofrs/flock v0.0.0-20190320160742-5135e617513b
#6 1.579 go: downloading golang.org/x/tools v0.0.0-20200204192400-7124308813f3
#6 1.582 go: downloading github.com/mattn/go-colorable v0.1.4
#8 3.159 Reading package lists...#6 1.586 go: downloading github.com/golangci/maligned v0.0.0-20180506175553-b1d89398deca
#6 1.587 go: downloading honnef.co/go/tools v0.0.1-2020.1.3
#6 1.588 go: downloading github.com/sourcegraph/go-diff v0.5.1
#6 1.599 go: extracting github.com/fatih/color v1.7.0
#6 1.602 go: extracting github.com/golangci/maligned v0.0.0-20180506175553-b1d89398deca
#6 1.602 go: downloading github.com/matoous/godox v0.0.0-20190911065817-5d6d842e92eb
#6 1.603 go: downloading github.com/spf13/viper v1.6.1
#6 1.608 go: extracting github.com/mattn/go-colorable v0.1.4
#6 1.610 go: downloading github.com/pkg/errors v0.8.1
#6 1.614 go: extracting github.com/matoous/godox v0.0.0-20190911065817-5d6d842e92eb
#6 1.643 go: extracting github.com/spf13/viper v1.6.1
#6 1.650 go: downloading github.com/golangci/unconvert v0.0.0-20180507085042-28b1c447d1f4
#6 1.651 go: extracting github.com/sourcegraph/go-diff v0.5.1
#6 1.662 go: extracting github.com/pkg/errors v0.8.1
#6 1.696 go: extracting github.com/golangci/unconvert v0.0.0-20180507085042-28b1c447d1f4
#6 1.710 go: extracting honnef.co/go/tools v0.0.1-2020.1.3
#6 1.781 go: downloading github.com/golangci/revgrep v0.0.0-20180526074752-d9c87f5ffaf0
#6 1.792 go: extracting github.com/golangci/revgrep v0.0.0-20180526074752-d9c87f5ffaf0
#6 1.794 go: downloading github.com/golangci/prealloc v0.0.0-20180630174525-215b22d4de21
#6 1.804 go: extracting github.com/golangci/prealloc v0.0.0-20180630174525-215b22d4de21
#6 1.805 go: downloading github.com/sirupsen/logrus v1.4.2
#6 1.826 go: extracting github.com/sirupsen/logrus v1.4.2
#6 1.828 go: extracting golang.org/x/tools v0.0.0-20200204192400-7124308813f3
#6 1.834 go: downloading golang.org/x/sys v0.0.0-20190922100055-0a153f010e69
#6 2.027 go: downloading github.com/spf13/cobra v0.0.5
#6 2.028 go: downloading sourcegraph.com/sqs/pbtypes v0.0.0-20180604144634-d3ebe8f20ae4
#6 2.028 go: downloading github.com/golangci/gofmt v0.0.0-20190930125516-244bba706f1a
#6 2.029 go: downloading github.com/stretchr/testify v1.4.0
#6 2.030 go: downloading github.com/securego/gosec v0.0.0-20200103095621-79fbf3af8d83
#6 2.031 go: downloading github.com/konsorten/go-windows-terminal-sequences v1.0.1
#6 2.038 go: downloading github.com/ultraware/funlen v0.0.2
#6 2.041 go: downloading github.com/mitchellh/mapstructure v1.1.2
#6 2.041 go: downloading github.com/gogo/protobuf v1.2.1
#6 2.049 go: extracting github.com/konsorten/go-windows-terminal-sequences v1.0.1
#6 2.050 go: downloading github.com/bombsimon/wsl/v2 v2.0.0
#6 2.075 go: extracting github.com/stretchr/testify v1.4.0

#8 3.777 Building dependency tree...
#8 3.891 Reading state information...
#6 2.094 go: extracting github.com/bombsimon/wsl/v2 v2.0.0
#6 2.096 go: extracting github.com/securego/gosec v0.0.0-20200103095621-79fbf3af8d83
#6 2.098 go: downloading github.com/subosito/gotenv v1.2.0
#6 2.099 go: extracting github.com/golangci/gofmt v0.0.0-20190930125516-244bba706f1a
#6 2.103 go: extracting github.com/mitchellh/mapstructure v1.1.2
#6 2.107 go: downloading github.com/golangci/dupl v0.0.0-20180902072040-3e9179ac440a
#6 2.116 go: extracting golang.org/x/sys v0.0.0-20190922100055-0a153f010e69
#6 2.130 go: downloading gopkg.in/yaml.v2 v2.2.7
#6 2.137 go: downloading github.com/hashicorp/hcl v1.0.0
#6 2.141 go: extracting github.com/ultraware/funlen v0.0.2
#6 2.142 go: downloading github.com/go-lintpack/lintpack v0.5.2
#6 2.143 go: extracting sourcegraph.com/sqs/pbtypes v0.0.0-20180604144634-d3ebe8f20ae4
#6 2.146 go: downloading github.com/golangci/check v0.0.0-20180506172741-cfe4005ccda2
#6 2.154 go: extracting github.com/golangci/dupl v0.0.0-20180902072040-3e9179ac440a
#6 2.160 go: downloading github.com/spf13/pflag v1.0.5
#6 2.165 go: extracting github.com/spf13/cobra v0.0.5
#6 2.168 go: extracting github.com/subosito/gotenv v1.2.0
#6 2.170 go: downloading golang.org/x/text v0.3.2
#6 2.187 go: downloading github.com/ultraware/whitespace v0.0.4
#6 2.192 go: extracting github.com/hashicorp/hcl v1.0.0
#6 2.193 go: extracting github.com/golangci/check v0.0.0-20180506172741-cfe4005ccda2
#6 2.196 go: downloading github.com/magiconair/properties v1.8.1
#6 2.206 go: extracting github.com/go-lintpack/lintpack v0.5.2
#6 2.211 go: downloading gopkg.in/ini.v1 v1.51.0
#6 2.247 go: extracting gopkg.in/yaml.v2 v2.2.7
#6 2.255 go: downloading github.com/golangci/goconst v0.0.0-20180610141641-041c5f2b40f3
#6 2.260 go: downloading github.com/golangci/errcheck v0.0.0-20181223084120-ef45e06d44b6
#6 2.260 go: extracting github.com/spf13/pflag v1.0.5
#6 2.272 go: downloading github.com/spf13/jwalterweatherman v1.0.0
#6 2.285 go: extracting github.com/ultraware/whitespace v0.0.4
#6 2.291 go: downloading github.com/golangci/go-misc v0.0.0-20180628070357-927a3d87b613
#6 2.318 go: extracting github.com/golangci/goconst v0.0.0-20180610141641-041c5f2b40f3
#6 2.320 go: downloading mvdan.cc/interfacer v0.0.0-20180901003855-c20040233aed
#6 2.328 go: downloading github.com/kisielk/gotool v1.0.0
#6 2.329 go: extracting gopkg.in/ini.v1 v1.51.0
#6 2.331 go: extracting github.com/golangci/errcheck v0.0.0-20181223084120-ef45e06d44b6
#6 2.334 go: downloading github.com/golangci/gocyclo v0.0.0-20180528134321-2becd97e67ee
#6 2.340 go: extracting github.com/kisielk/gotool v1.0.0
#6 2.344 go: downloading github.com/pelletier/go-toml v1.2.0
#6 2.354 go: extracting github.com/magiconair/properties v1.8.1
#6 2.358 go: downloading github.com/golangci/lint-1 v0.0.0-20191013205115-297bf364a8e0
#6 2.368 go: downloading github.com/inconshreveable/mousetrap v1.0.0
#6 2.374 go: extracting github.com/spf13/jwalterweatherman v1.0.0
#6 2.379 go: downloading github.com/go-critic/go-critic v0.4.1
#6 2.386 go: extracting mvdan.cc/interfacer v0.0.0-20180901003855-c20040233aed
#6 2.392 go: downloading github.com/OpenPeeDeeP/depguard v1.0.1
#8 4.027 coreutils is already the newest version (8.30-3).
#8 4.027 coreutils set to manually installed.
#8 4.027 util-linux is already the newest version (2.33.1-0.1).
#8 4.027 util-linux set to manually installed.
#8 4.027 The following NEW packages will be installed:
#8 4.027   uuid-runtime
#6 2.422 go: extracting github.com/golangci/lint-1 v0.0.0-20191013205115-297bf364a8e0
#6 2.423 go: extracting github.com/golangci/go-misc v0.0.0-20180628070357-927a3d87b613
#6 2.429 go: downloading github.com/davecgh/go-spew v1.1.1
#6 2.437 go: extracting github.com/inconshreveable/mousetrap v1.0.0
#6 2.440 go: downloading github.com/golangci/misspell v0.0.0-20180809174111-950f5d19e770
#6 2.442 go: extracting github.com/golangci/gocyclo v0.0.0-20180528134321-2becd97e67ee
#6 2.473 go: downloading github.com/mitchellh/go-homedir v1.1.0
#6 2.504 go: extracting github.com/pelletier/go-toml v1.2.0
#6 2.511 go: extracting github.com/OpenPeeDeeP/depguard v1.0.1
#6 2.514 go: downloading mvdan.cc/lint v0.0.0-20170908181259-adc824a0674b
#6 2.525 go: extracting github.com/davecgh/go-spew v1.1.1
#6 2.531 go: downloading github.com/uudashr/gocognit v1.0.1
#6 2.547 go: downloading github.com/go-toolsmith/astfmt v1.0.0
#6 2.551 go: extracting github.com/uudashr/gocognit v1.0.1
#6 2.552 go: downloading github.com/golangci/ineffassign v0.0.0-20190609212857-42439a7714cc
#6 2.558 go: extracting github.com/mitchellh/go-homedir v1.1.0
#6 2.560 go: downloading github.com/BurntSushi/toml v0.3.1
#6 2.562 go: downloading github.com/jingyugao/rowserrcheck v0.0.0-20191204022205-72ab7603b68a
#6 2.567 go: downloading github.com/spf13/cast v1.3.0
#6 2.571 go: extracting github.com/golangci/misspell v0.0.0-20180809174111-950f5d19e770
#6 2.582 go: extracting github.com/spf13/cast v1.3.0
#6 2.584 go: downloading github.com/nbutton23/zxcvbn-go v0.0.0-20180912185939-ae427f1e4c1d
#6 2.594 go: extracting mvdan.cc/lint v0.0.0-20170908181259-adc824a0674b
#6 2.596 go: extracting github.com/go-critic/go-critic v0.4.1
#6 2.597 go: downloading mvdan.cc/unparam v0.0.0-20190720180237-d51796306d8f
#6 2.615 go: downloading github.com/mattn/go-isatty v0.0.8
#8 4.291 0 upgraded, 1 newly installed, 0 to remove and 4 not upgraded.
#8 4.291 Need to get 95.2 kB of archives.
#8 4.291 After this operation, 211 kB of additional disk space will be used.
#8 4.291 Get:1 http://deb.debian.org/debian buster/main amd64 uuid-runtime amd64 2.33.1-0.1 [95.2 kB]
#8 4.412 debconf: delaying package configuration, since apt-utils is not installed
#8 4.435 Fetched 95.2 kB in 0s (369 kB/s)
#8 4.456 Selecting previously unselected package uuid-runtime.
#8 4.456 (Reading database ... 
(Reading database ... 5%
(Reading database ... 10%
(Reading database ... 15%
(Reading database ... 20%
(Reading database ... 25%
(Reading database ... 30%
(Reading database ... 35%
(Reading database ... 40%
(Reading database ... 45%
(Reading database ... 50%
(Reading database ... 55%
(Reading database ... 60%
(Reading database ... 65%
(Reading database ... 70%
(Reading database ... 75%
(Reading database ... 80%
(Reading database ... 85%
(Reading database ... 90%
(Reading database ... 95%
(Reading database ... 100%
(Reading database ... 15405 files and directories currently installed.)
#8 4.465 Preparing to unpack .../uuid-runtime_2.33.1-0.1_amd64.deb ...
#8 4.468 Unpacking uuid-runtime (2.33.1-0.1) ...
#8 4.504 Setting up uuid-runtime (2.33.1-0.1) ...
#8 4.537 Adding group `uuidd' (GID 102) ...
#6 2.616 go: extracting github.com/go-toolsmith/astfmt v1.0.0
#6 2.620 go: downloading github.com/spf13/afero v1.1.2
#6 2.622 go: extracting github.com/BurntSushi/toml v0.3.1
#6 2.629 go: extracting github.com/jingyugao/rowserrcheck v0.0.0-20191204022205-72ab7603b68a
#6 2.635 go: downloading github.com/tommy-muehle/go-mnd v1.3.1-0.20200224220436-e6f9a994e8fa
#6 2.648 go: downloading github.com/fsnotify/fsnotify v1.4.7
#6 2.652 go: extracting github.com/golangci/ineffassign v0.0.0-20190609212857-42439a7714cc
#6 2.657 go: downloading github.com/stretchr/objx v0.2.0
#6 2.691 go: extracting github.com/stretchr/objx v0.2.0
#6 2.698 go: downloading github.com/gostaticanalysis/analysisutil v0.0.0-20190318220348-4088753ea4d3
#6 2.725 go: downloading github.com/pmezard/go-difflib v1.0.0
#6 2.731 go: extracting github.com/mattn/go-isatty v0.0.8
#6 2.733 go: downloading github.com/go-toolsmith/astequal v1.0.0
#6 2.746 go: extracting mvdan.cc/unparam v0.0.0-20190720180237-d51796306d8f
#6 2.747 go: extracting github.com/go-toolsmith/astequal v1.0.0
#6 2.750 go: downloading github.com/gobwas/glob v0.2.3
#6 2.754 go: extracting github.com/spf13/afero v1.1.2
#6 2.760 go: downloading github.com/jirfag/go-printf-func-name v0.0.0-20191110105641-45db9963cdd3
#6 2.772 go: downloading github.com/go-toolsmith/astcast v1.0.0
#6 2.779 go: extracting github.com/tommy-muehle/go-mnd v1.3.1-0.20200224220436-e6f9a994e8fa
#6 2.786 go: extracting github.com/gostaticanalysis/analysisutil v0.0.0-20190318220348-4088753ea4d3
#6 2.789 go: extracting github.com/fsnotify/fsnotify v1.4.7
#6 2.796 go: extracting github.com/go-toolsmith/astcast v1.0.0
#6 2.797 go: downloading github.com/timakin/bodyclose v0.0.0-20190930140734-f7f2e9bca95e
#6 2.801 go: extracting github.com/gogo/protobuf v1.2.1
#6 2.809 go: downloading github.com/go-toolsmith/strparse v1.0.0
#6 2.811 go: extracting github.com/jirfag/go-printf-func-name v0.0.0-20191110105641-45db9963cdd3
#6 2.816 go: extracting github.com/nbutton23/zxcvbn-go v0.0.0-20180912185939-ae427f1e4c1d
#6 2.823 go: downloading github.com/go-toolsmith/typep v1.0.0
#6 2.827 go: extracting github.com/go-toolsmith/strparse v1.0.0
#8 4.550 Done.
#8 4.575 Warning: The home dir /run/uuidd you specified can't be accessed: No such file or directory
#8 4.576 Adding system user `uuidd' (UID 101) ...
#8 4.576 Adding new user `uuidd' (UID 101) with group `uuidd' ...
#8 4.611 Not creating home directory `/run/uuidd'.
#8 4.622 invoke-rc.d: could not determine current runlevel
#8 4.624 invoke-rc.d: policy-rc.d denied execution of start.
#6 2.828 go: extracting github.com/pmezard/go-difflib v1.0.0
#6 2.868 go: downloading github.com/go-toolsmith/astcopy v1.0.0
#6 2.869 go: extracting github.com/gobwas/glob v0.2.3
#6 2.871 go: downloading github.com/go-toolsmith/astp v1.0.0
#6 2.879 go: extracting github.com/go-toolsmith/typep v1.0.0
#6 2.891 go: extracting github.com/go-toolsmith/astp v1.0.0
#6 2.895 go: extracting github.com/go-toolsmith/astcopy v1.0.0
#6 2.899 go: extracting github.com/timakin/bodyclose v0.0.0-20190930140734-f7f2e9bca95e
#8 DONE 5.1s

#9 [build 3/5] WORKDIR /go/src/github.com/docker/app/
#6 3.149 go: extracting golang.org/x/text v0.3.2
#9 DONE 0.0s

#11 [build 4/5] COPY . .
#6 3.532 go: finding github.com/fatih/color v1.7.0
#6 3.537 go: finding github.com/gofrs/flock v0.0.0-20190320160742-5135e617513b
#6 3.541 go: finding github.com/mattn/go-colorable v0.1.4
#6 3.543 go: finding github.com/mattn/go-isatty v0.0.8
#6 3.548 go: finding github.com/go-critic/go-critic v0.4.1
#6 3.552 go: finding golang.org/x/tools v0.0.0-20200204192400-7124308813f3
#6 3.555 go: finding golang.org/x/sys v0.0.0-20190922100055-0a153f010e69
#6 3.557 go: finding github.com/go-lintpack/lintpack v0.5.2
#6 3.582 go: finding github.com/pkg/errors v0.8.1
#6 3.588 go: finding github.com/go-toolsmith/astfmt v1.0.0
#6 3.590 go: finding github.com/sirupsen/logrus v1.4.2
#6 3.591 go: finding github.com/go-toolsmith/astequal v1.0.0
#6 3.593 go: finding github.com/mitchellh/go-homedir v1.1.0
#6 3.594 go: finding github.com/stretchr/testify v1.4.0
#6 3.597 go: finding github.com/go-toolsmith/astp v1.0.0
#6 3.598 go: finding github.com/go-toolsmith/astcast v1.0.0
#6 3.600 go: finding github.com/davecgh/go-spew v1.1.1
#6 3.603 go: finding github.com/go-toolsmith/typep v1.0.0
#6 3.603 go: finding github.com/spf13/viper v1.6.1
#6 3.605 go: finding github.com/pmezard/go-difflib v1.0.0
#6 3.612 go: finding github.com/go-toolsmith/astcopy v1.0.0
#6 3.614 go: finding github.com/stretchr/objx v0.2.0
#6 3.622 go: finding gopkg.in/yaml.v2 v2.2.7
#6 3.623 go: finding github.com/go-toolsmith/strparse v1.0.0
#6 3.623 go: finding github.com/OpenPeeDeeP/depguard v1.0.1
#6 3.631 go: finding github.com/bombsimon/wsl/v2 v2.0.0
#6 3.631 go: finding github.com/gobwas/glob v0.2.3
#6 3.638 go: finding github.com/fsnotify/fsnotify v1.4.7
#6 3.647 go: finding github.com/spf13/cobra v0.0.5
#6 3.656 go: finding github.com/hashicorp/hcl v1.0.0
#6 3.661 go: finding github.com/spf13/pflag v1.0.5
#6 3.664 go: finding github.com/golangci/check v0.0.0-20180506172741-cfe4005ccda2
#6 3.674 go: finding github.com/magiconair/properties v1.8.1
#6 3.677 go: finding github.com/golangci/dupl v0.0.0-20180902072040-3e9179ac440a
#6 3.679 go: finding github.com/mitchellh/mapstructure v1.1.2
#6 3.681 go: finding github.com/golangci/errcheck v0.0.0-20181223084120-ef45e06d44b6
#6 3.683 go: finding github.com/pelletier/go-toml v1.2.0
#6 3.685 go: finding github.com/golangci/go-misc v0.0.0-20180628070357-927a3d87b613
#6 3.689 go: finding github.com/spf13/afero v1.1.2
#6 3.690 go: finding github.com/golangci/goconst v0.0.0-20180610141641-041c5f2b40f3
#6 3.694 go: finding golang.org/x/text v0.3.2
#6 3.694 go: finding github.com/spf13/cast v1.3.0
#6 3.697 go: finding github.com/golangci/gocyclo v0.0.0-20180528134321-2becd97e67ee
#6 3.701 go: finding github.com/spf13/jwalterweatherman v1.0.0
#6 3.704 go: finding github.com/golangci/revgrep v0.0.0-20180526074752-d9c87f5ffaf0
#6 3.706 go: finding github.com/subosito/gotenv v1.2.0
#6 3.706 go: finding github.com/golangci/gofmt v0.0.0-20190930125516-244bba706f1a
#6 3.710 go: finding gopkg.in/ini.v1 v1.51.0
#6 3.714 go: finding github.com/golangci/ineffassign v0.0.0-20190609212857-42439a7714cc
#6 3.715 go: finding github.com/golangci/lint-1 v0.0.0-20191013205115-297bf364a8e0
#6 3.719 go: finding github.com/golangci/maligned v0.0.0-20180506175553-b1d89398deca
#6 3.726 go: finding github.com/golangci/misspell v0.0.0-20180809174111-950f5d19e770
#6 3.728 go: finding github.com/golangci/prealloc v0.0.0-20180630174525-215b22d4de21
#6 3.731 go: finding github.com/golangci/unconvert v0.0.0-20180507085042-28b1c447d1f4
#6 3.733 go: finding github.com/jingyugao/rowserrcheck v0.0.0-20191204022205-72ab7603b68a
#6 3.736 go: finding github.com/jirfag/go-printf-func-name v0.0.0-20191110105641-45db9963cdd3
#6 3.737 go: finding github.com/kisielk/gotool v1.0.0
#6 3.738 go: finding github.com/matoous/godox v0.0.0-20190911065817-5d6d842e92eb
#6 3.741 go: finding github.com/gostaticanalysis/analysisutil v0.0.0-20190318220348-4088753ea4d3
#6 3.743 go: finding github.com/securego/gosec v0.0.0-20200103095621-79fbf3af8d83
#6 3.749 go: finding github.com/sourcegraph/go-diff v0.5.1
#6 3.753 go: finding github.com/timakin/bodyclose v0.0.0-20190930140734-f7f2e9bca95e
#6 3.757 go: finding github.com/nbutton23/zxcvbn-go v0.0.0-20180912185939-ae427f1e4c1d
#6 3.762 go: finding github.com/tommy-muehle/go-mnd v1.3.1-0.20200224220436-e6f9a994e8fa
#6 3.768 go: finding github.com/ultraware/funlen v0.0.2
#6 3.774 go: finding github.com/ultraware/whitespace v0.0.4
#6 3.776 go: finding github.com/uudashr/gocognit v1.0.1
#6 3.781 go: finding sourcegraph.com/sqs/pbtypes v0.0.0-20180604144634-d3ebe8f20ae4
#6 3.783 go: finding github.com/gogo/protobuf v1.2.1
#6 3.794 go: finding honnef.co/go/tools v0.0.1-2020.1.3
#6 3.802 go: finding mvdan.cc/interfacer v0.0.0-20180901003855-c20040233aed
#6 3.803 go: finding mvdan.cc/unparam v0.0.0-20190720180237-d51796306d8f
#6 3.810 go: finding github.com/BurntSushi/toml v0.3.1
#6 3.811 go: finding mvdan.cc/lint v0.0.0-20170908181259-adc824a0674b
#4 extracting sha256:4feb95896f3c7a0fd4c4b42dd7419eb5857133919137ae19e7f889243c2e329d 4.1s done
#4 extracting sha256:c7b88469670a8ad543aff31d4eca30e2985f84fcf5db46d6710885672cc438b6 done
#4 extracting sha256:ff08e1e3892413cf1db5c7bb4ef561221a982ae8c351691642192fbaa6606691 done
#4 extracting sha256:8f48c2e5d9a18780aeec30e1221d5c8cf0a0c9e0e168f36ff96db909bd55b03d
#11 DONE 0.7s

#12 [build 5/5] RUN make BUILD_TAG=${BUILD_TAG} TAG=jenkins-app-PR-801-6 bin...
#12 1.015 CGO_ENABLED=0 go build -tags= -ldflags="-s -w -X github.com/docker/app/internal.GitCommit=a1df96ab -X github.com/docker/app/internal.Version=jenkins-app-PR-801-6" -o bin/cnab-run ./cmd/cnab-run
#4 extracting sha256:8f48c2e5d9a18780aeec30e1221d5c8cf0a0c9e0e168f36ff96db909bd55b03d 1.9s done
#4 extracting sha256:898ab219a8f792839ff6daceb49fb4e78f66601575f3b39d91c1703f139ac170 0.1s
#4 extracting sha256:898ab219a8f792839ff6daceb49fb4e78f66601575f3b39d91c1703f139ac170 5.3s
#4 extracting sha256:898ab219a8f792839ff6daceb49fb4e78f66601575f3b39d91c1703f139ac170 5.4s done
#4 extracting sha256:a321a30e9b5a3f2509eaa322f2075f2d0643388fa6aa38a338c19c044c150d9b
#4 extracting sha256:a321a30e9b5a3f2509eaa322f2075f2d0643388fa6aa38a338c19c044c150d9b 5.0s
#4 extracting sha256:a321a30e9b5a3f2509eaa322f2075f2d0643388fa6aa38a338c19c044c150d9b 10.2s
#4 extracting sha256:a321a30e9b5a3f2509eaa322f2075f2d0643388fa6aa38a338c19c044c150d9b 12.5s done
#4 extracting sha256:7be16483962b3813f72dd7407838db2cb62032e913e676ecfa0eb08261f48bab done
#4 DONE 36.3s

#5 [cli-build 2/10] RUN apt-get update && apt-get install -y -q --no-instal...
#5 0.850 Get:1 http://deb.debian.org/debian buster InRelease [122 kB]
#5 0.861 Get:2 http://deb.debian.org/debian buster-updates InRelease [49.3 kB]
#5 0.862 Get:3 http://security.debian.org/debian-security buster/updates InRelease [65.4 kB]
#5 0.950 Get:4 http://deb.debian.org/debian buster/main amd64 Packages [7907 kB]
#5 1.078 Get:5 http://deb.debian.org/debian buster-updates/main amd64 Packages [7380 B]
#5 1.200 Get:6 http://security.debian.org/debian-security buster/updates/main amd64 Packages [187 kB]
#5 2.248 Fetched 8338 kB in 2s (5053 kB/s)
#5 2.248 Reading package lists...
#5 2.819 Reading package lists...
#5 3.383 Building dependency tree...
#5 3.503 Reading state information...
#5 3.638 coreutils is already the newest version (8.30-3).
#5 3.638 coreutils set to manually installed.
#5 3.638 util-linux is already the newest version (2.33.1-0.1).
#5 3.638 util-linux set to manually installed.
#5 3.638 The following NEW packages will be installed:
#5 3.638   uuid-runtime
#5 3.902 0 upgraded, 1 newly installed, 0 to remove and 5 not upgraded.
#5 3.902 Need to get 95.2 kB of archives.
#5 3.902 After this operation, 211 kB of additional disk space will be used.
#5 3.902 Get:1 http://deb.debian.org/debian buster/main amd64 uuid-runtime amd64 2.33.1-0.1 [95.2 kB]
#5 4.014 debconf: delaying package configuration, since apt-utils is not installed
#5 4.037 Fetched 95.2 kB in 0s (371 kB/s)
#5 4.059 Selecting previously unselected package uuid-runtime.
#5 4.059 (Reading database ... 
(Reading database ... 5%
(Reading database ... 10%
(Reading database ... 15%
(Reading database ... 20%
(Reading database ... 25%
(Reading database ... 30%
(Reading database ... 35%
(Reading database ... 40%
(Reading database ... 45%
(Reading database ... 50%
(Reading database ... 55%
(Reading database ... 60%
(Reading database ... 65%
(Reading database ... 70%
(Reading database ... 75%
(Reading database ... 80%
(Reading database ... 85%
(Reading database ... 90%
(Reading database ... 95%
(Reading database ... 100%
(Reading database ... 25426 files and directories currently installed.)
#5 4.071 Preparing to unpack .../uuid-runtime_2.33.1-0.1_amd64.deb ...
#5 4.074 Unpacking uuid-runtime (2.33.1-0.1) ...
#5 4.112 Setting up uuid-runtime (2.33.1-0.1) ...
#5 4.145 Adding group `uuidd' (GID 102) ...
#5 4.160 Done.
#5 4.186 Warning: The home dir /run/uuidd you specified can't be accessed: No such file or directory
#5 4.187 Adding system user `uuidd' (UID 101) ...
#5 4.187 Adding new user `uuidd' (UID 101) with group `uuidd' ...
#5 4.220 Not creating home directory `/run/uuidd'.
#5 4.228 invoke-rc.d: could not determine current runlevel
#5 4.231 invoke-rc.d: policy-rc.d denied execution of start.
#6 DONE 27.3s

#7 [4/5] WORKDIR /go/src/github.com/docker/app
#7 DONE 0.0s

#9 [5/5] COPY . .
#9 DONE 0.5s

#10 exporting to image
#10 exporting layers
#10 exporting layers 1.9s done
#10 writing image sha256:fcca702b7ae53d6803c9464c1c3518ea69f98b0c2655d5980eccccd8af0db1dd done
#10 naming to docker.io/library/docker-app-lint:jenkins-app-PR-801-6 done
#10 DONE 1.9s
docker run --rm docker-app-lint:jenkins-app-PR-801-6 make lint
Linting...
GOGC=75 golangci-lint run --verbose --print-resources-usage --timeout 10m0s ./...
#5 DONE 6.0s

#6 [cli-build 3/10] WORKDIR /go/src/github.com/docker/cli
#6 DONE 0.0s

#7 [cli-build 4/10] RUN git clone https://github.com/docker/cli . && git ch...
level=info msg="[config_reader] Config search paths: [./ /go/src/github.com/docker/app /go/src/github.com/docker /go/src/github.com /go/src /go /]"
level=info msg="[config_reader] Used config file .golangci.yml"
level=info msg="[lintersdb] Active 20 linters: [deadcode errcheck gocyclo gofmt goimports golint gosimple govet ineffassign interfacer lll misspell nakedret staticcheck structcheck typecheck unconvert unparam unused varcheck]"
level=info msg="[lintersdb] Active 20 linters: [deadcode errcheck gocyclo gofmt goimports golint gosimple govet ineffassign interfacer lll misspell nakedret staticcheck structcheck typecheck unconvert unparam unused varcheck]"
#7 0.607 Cloning into '.'...
#7 14.54 Note: checking out 'v19.03.8'.
#7 14.54 
#7 14.54 You are in 'detached HEAD' state. You can look around, make experimental
#7 14.54 changes and commit them, and you can discard any commits you make in this
#7 14.54 state without impacting any branches by performing another checkout.
#7 14.54 
#7 14.54 If you want to create a new branch to retain commits you create, you may
#7 14.54 do so (now or later) by using -b with the checkout command again. Example:
#7 14.54 
#7 14.54   git checkout -b <new-branch-name>
#7 14.54 
#7 14.54 HEAD is now at eb310fca49 Merge pull request #2373 from tiborvass/19.03-bump-grpc-1.23.1
#7 DONE 14.9s

#8 [cli-build 5/10] RUN mkdir build
#8 DONE 0.7s

#9 [cli-build 6/10] RUN curl -fL https://download.docker.com/linux/static/s...
#9 0.606   % Total    % Received % Xferd  Average Speed   Time    Time     Time  Current
#9 0.606                                  Dload  Upload   Total   Spent    Left  Speed
#9 0.607 
  0     0    0     0    0     0      0      0 --:--:-- --:--:-- --:--:--     0
  2 60.7M    2 1660k    0     0  6059k      0  0:00:10 --:--:--  0:00:10 6037k
 58 60.7M   58 35.6M    0     0  28.1M      0  0:00:02  0:00:01  0:00:01 28.1M
100 60.7M  100 60.7M    0     0  30.9M      0  0:00:01  0:00:01 --:--:-- 30.9M
#9 DONE 2.8s

#10 [cli-build 7/10] RUN curl -fL https://download.docker.com/linux/static/s...
#10 0.625   % Total    % Received % Xferd  Average Speed   Time    Time     Time  Current
#10 0.626                                  Dload  Upload   Total   Spent    Left  Speed
#10 0.627 
  0     0    0     0    0     0      0      0 --:--:-- --:--:-- --:--:--     0
 13 53.9M   13 7375k    0     0  15.3M      0  0:00:03 --:--:--  0:00:03 15.2M
 77 53.9M   77 41.5M    0     0  27.9M      0  0:00:01  0:00:01 --:--:-- 27.9M
100 53.9M  100 53.9M    0     0  29.4M      0  0:00:01  0:00:01 --:--:-- 29.4M
#10 DONE 2.6s

#11 [cli-build 8/10] RUN curl -fL https://download.docker.com/linux/static/s...
#11 0.637   % Total    % Received % Xferd  Average Speed   Time    Time     Time  Current
#11 0.637                                  Dload  Upload   Total   Spent    Left  Speed
#11 0.638 
  0     0    0     0    0     0      0      0 --:--:-- --:--:-- --:--:--     0
 38 55.6M   38 21.2M    0     0  25.4M      0  0:00:02 --:--:--  0:00:02 25.4M
100 55.6M  100 55.6M    0     0  31.2M      0  0:00:01  0:00:01 --:--:-- 31.2M
#11 DONE 2.6s

#12 [cli-build 9/10] RUN curl -fL https://download.docker.com/mac/static/sta...
#12 0.608   % Total    % Received % Xferd  Average Speed   Time    Time     Time  Current
#12 0.608                                  Dload  Upload   Total   Spent    Left  Speed
#12 0.608 
  0     0    0     0    0     0      0      0 --:--:-- --:--:-- --:--:--     0
  1 45.6M    1  907k    0     0  3193k      0  0:00:14 --:--:--  0:00:14 3182k
 78 45.6M   78 36.0M    0     0  28.1M      0  0:00:01  0:00:01 --:--:-- 28.1M
100 45.6M  100 45.6M    0     0  31.7M      0  0:00:01  0:00:01 --:--:-- 31.7M
#12 DONE 2.2s

#13 [cli-build 10/10] RUN make binary-windows
#13 0.614 ./scripts/build/windows
#13 0.629 Generating windows resources
#13 0.661 Building build/docker-windows-amd64
#12 DONE 63.9s

#13 [invocation 3/4] COPY --from=build /go/src/github.com/docker/app/bin/cna...
#13 DONE 0.1s

#14 [invocation 4/4] WORKDIR /cnab/app
#14 DONE 0.1s

#15 exporting to image
#15 exporting layers
#15 exporting layers 0.2s done
#15 writing image sha256:e69a1dba4418ff98818de7bce6e0e70028befd4e5df90492ab30c7f991b3dfd5 done
#15 naming to docker.io/docker/cnab-app-base:jenkins-app-PR-801-6 done
#15 naming to docker.io/docker/cnab-app-base:jenkins-app-PR-801-6-amd64 done
#15 DONE 0.2s
docker save docker/cnab-app-base:jenkins-app-PR-801-6 -o _build/invocation-image.tar
[Pipeline] sh
+ make -f docker.Makefile INVOCATION_IMAGE_TAG=jenkins-app-PR-801-6-coverage OUTPUT=coverage-invocation-image.tar save-invocation-image-tag
docker tag docker/cnab-app-base:jenkins-app-PR-801-6 docker/cnab-app-base:jenkins-app-PR-801-6-coverage
docker save docker/cnab-app-base:jenkins-app-PR-801-6-coverage -o _build/coverage-invocation-image.tar
[Pipeline] }
[Pipeline] // ansiColor
[Pipeline] dir
Running in /home/ubuntu/workspace/app_PR-801/src/github.com/docker/app/_build
[Pipeline] {
[Pipeline] stash
Stashed 1 file(s) to https://corp-us-east-1-jenkins-k8s-maste-jenkinsartifacts-1lzm7adht5e1j.s3.amazonaws.com/public/app/PR-801/6/stashes/invocation-image.tgz
[Pipeline] stash
Stashed 1 file(s) to https://corp-us-east-1-jenkins-k8s-maste-jenkinsartifacts-1lzm7adht5e1j.s3.amazonaws.com/public/app/PR-801/6/stashes/coverage-invocation-image.tgz
[Pipeline] }
[Pipeline] // dir
[Pipeline] }
[Pipeline] // dir
Post stage
[Pipeline] dir
Running in /home/ubuntu/workspace/app_PR-801/src/github.com/docker/app
[Pipeline] {
[Pipeline] sh
+ docker rmi docker/cnab-app-base:jenkins-app-PR-801-6
Untagged: docker/cnab-app-base:jenkins-app-PR-801-6
[Pipeline] sh
+ docker rmi docker/cnab-app-base:jenkins-app-PR-801-6-coverage
Untagged: docker/cnab-app-base:jenkins-app-PR-801-6-coverage
[Pipeline] }
[Pipeline] // dir
[Pipeline] deleteDir
[Pipeline] }
[Pipeline] // node
[Pipeline] }
[Pipeline] // stage
[Pipeline] }
level=info msg="[loader] Go packages loading at mode 575 (exports_file|files|name|compiled_files|deps|types_sizes|imports) took 1m12.474253173s"
level=info msg="[runner/filename_unadjuster] Pre-built 0 adjustments in 20.808041ms"
#13 DONE 80.2s

#14 [cli 1/3] COPY --from=cli-build /go/src/github.com/docker/cli/build/dock...
#14 DONE 0.1s

#15 [cli 2/3] COPY --from=cli-build /go/src/github.com/docker/cli/build/dock...
#15 DONE 0.3s

#16 [cli 3/3] COPY --from=cli-build /go/src/github.com/docker/cli/build/dock...
#16 DONE 0.2s

#17 exporting to client
#17 copying files 35B
#17 copying files 180.57MB 1.1s done
#17 DONE 1.4s
docker build --build-arg TAG=jenkins-app-PR-801-6 --build-arg COMMIT=a1df96ab --build-arg ALPINE_VERSION=3.11.5 --build-arg GOPROXY=direct --output type=local,dest=./bin/ --target=cross -t docker-app-cross:jenkins-app-PR-801-6 .
#1 [internal] load .dockerignore
#1 transferring context: 34B done
#1 DONE 0.0s

#2 [internal] load build definition from Dockerfile
#2 transferring dockerfile: 38B done
#2 DONE 0.0s

#4 [internal] load metadata for docker.io/dockercore/golang-cross:1.13.10@s...
#4 DONE 0.0s

#3 [internal] load metadata for docker.io/library/golang:1.13.10
#3 DONE 0.1s

#8 [cli-build 1/10] FROM docker.io/dockercore/golang-cross:1.13.10@sha256:a...
#8 DONE 0.0s

#5 [dev 1/9] FROM docker.io/library/golang:1.13.10@sha256:81bd18af9605d1a47...
#5 CACHED

#10 [cli-build 3/10] WORKDIR /go/src/github.com/docker/cli
#10 CACHED

#14 [cli-build 7/10] RUN curl -fL https://download.docker.com/linux/static/s...
#14 CACHED

#15 [cli-build 8/10] RUN curl -fL https://download.docker.com/linux/static/s...
#15 CACHED

#9 [cli-build 2/10] RUN apt-get update && apt-get install -y -q --no-instal...
#9 CACHED

#12 [cli-build 5/10] RUN mkdir build
#12 CACHED

#13 [cli-build 6/10] RUN curl -fL https://download.docker.com/linux/static/s...
#13 CACHED

#16 [cli-build 9/10] RUN curl -fL https://download.docker.com/mac/static/sta...
#16 CACHED

#11 [cli-build 4/10] RUN git clone https://github.com/docker/cli . && git ch...
#11 CACHED

#17 [cli-build 10/10] RUN make binary-windows
#17 CACHED

#23 [internal] load build context
#23 transferring context: 80.86MB 1.9s done
#23 DONE 2.0s

#6 [dev 2/9] RUN apt-get update && apt-get install -y -q --no-install-recom...
#6 1.610 Get:1 http://security.debian.org/debian-security buster/updates InRelease [65.4 kB]
#6 1.620 Get:2 http://deb.debian.org/debian buster InRelease [122 kB]
#6 1.620 Get:3 http://deb.debian.org/debian buster-updates InRelease [49.3 kB]
#6 1.868 Get:4 http://security.debian.org/debian-security buster/updates/main amd64 Packages [187 kB]
#6 2.034 Get:5 http://deb.debian.org/debian buster/main amd64 Packages [7907 kB]
#6 2.163 Get:6 http://deb.debian.org/debian buster-updates/main amd64 Packages [7380 B]
#6 3.253 Fetched 8338 kB in 2s (4360 kB/s)
#6 3.253 Reading package lists...
#6 3.835 Reading package lists...
#6 4.390 Building dependency tree...
#6 4.492 Reading state information...
#6 4.631 coreutils is already the newest version (8.30-3).
#6 4.631 coreutils set to manually installed.
#6 4.631 util-linux is already the newest version (2.33.1-0.1).
#6 4.631 util-linux set to manually installed.
#6 4.631 The following NEW packages will be installed:
#6 4.631   uuid-runtime
#6 4.895 0 upgraded, 1 newly installed, 0 to remove and 4 not upgraded.
#6 4.895 Need to get 95.2 kB of archives.
#6 4.895 After this operation, 211 kB of additional disk space will be used.
#6 4.895 Get:1 http://deb.debian.org/debian buster/main amd64 uuid-runtime amd64 2.33.1-0.1 [95.2 kB]
#6 5.055 debconf: delaying package configuration, since apt-utils is not installed
#6 5.078 Fetched 95.2 kB in 0s (372 kB/s)
#6 5.109 Selecting previously unselected package uuid-runtime.
#6 5.109 (Reading database ... 
(Reading database ... 5%
(Reading database ... 10%
(Reading database ... 15%
(Reading database ... 20%
(Reading database ... 25%
(Reading database ... 30%
(Reading database ... 35%
(Reading database ... 40%
(Reading database ... 45%
(Reading database ... 50%
(Reading database ... 55%
(Reading database ... 60%
(Reading database ... 65%
(Reading database ... 70%
(Reading database ... 75%
(Reading database ... 80%
(Reading database ... 85%
(Reading database ... 90%
(Reading database ... 95%
(Reading database ... 100%
(Reading database ... 15405 files and directories currently installed.)
#6 5.180 Preparing to unpack .../uuid-runtime_2.33.1-0.1_amd64.deb ...
#6 5.183 Unpacking uuid-runtime (2.33.1-0.1) ...
#6 5.220 Setting up uuid-runtime (2.33.1-0.1) ...
#6 5.256 Adding group `uuidd' (GID 102) ...
#6 5.273 Done.
#6 5.297 Warning: The home dir /run/uuidd you specified can't be accessed: No such file or directory
#6 5.298 Adding system user `uuidd' (UID 101) ...
#6 5.298 Adding new user `uuidd' (UID 101) with group `uuidd' ...
#6 5.352 Not creating home directory `/run/uuidd'.
#6 5.364 invoke-rc.d: could not determine current runlevel
#6 5.367 invoke-rc.d: policy-rc.d denied execution of start.
#6 DONE 5.9s

#7 [dev 3/9] WORKDIR /go/src/github.com/docker/app/
#7 DONE 0.0s

#18 [dev 4/9] COPY --from=cli-build /go/src/github.com/docker/cli/build/dock...
#18 DONE 0.2s

#19 [dev 5/9] RUN curl -o /usr/bin/dep -L https://github.com/golang/dep/rele...
#19 0.627   % Total    % Received % Xferd  Average Speed   Time    Time     Time  Current
#19 0.627                                  Dload  Upload   Total   Spent    Left  Speed
#19 0.627 
  0     0    0     0    0     0      0      0 --:--:-- --:--:-- --:--:--     0
100   626  100   626    0     0  32947      0 --:--:-- --:--:-- --:--:-- 32947
#19 0.763 
100 10.5M  100 10.5M    0     0  77.1M      0 --:--:-- --:--:-- --:--:-- 77.1M
#19 DONE 0.9s

#20 [dev 6/9] RUN mkdir /go/src/gotest.tools &&   git clone -q https://githu...
level=info msg="[runner/goanalysis_metalinter/goanalysis] analyzers took 1m27.894599483s with top 10 stages: buildir: 1m9.726786952s, buildssa: 5.028807305s, inspect: 1.945424962s, unconvert: 1.758187473s, interfacer: 1.571281506s, ctrlflow: 1.105084156s, printf: 963.766248ms, fact_purity: 940.112174ms, unparam: 854.024506ms, fact_deprecated: 778.062719ms"
level=warning msg="[runner] Can't run linter goanalysis_metalinter: assign: failed prerequisites: [inspect@github.com/docker/app/e2e [github.com/docker/app/e2e.test]: analysis skipped: errors in package: [/go/src/github.com/docker/app/e2e/helper_test.go:132:9: no result values expected]]"
level=info msg="[runner/unused/goanalysis] analyzers took 3.159972721s with top 10 stages: buildir: 2.948910893s, U1000: 211.061828ms"
level=warning msg="[runner] Can't run linter unused: buildir: analysis skipped: errors in package: [/go/src/github.com/docker/app/e2e/helper_test.go:132:9: no result values expected]"
level=info msg="[runner] processing took 4.743µs with stages: max_same_issues: 671ns, nolint: 580ns, max_from_linter: 463ns, skip_dirs: 458ns, skip_files: 373ns, source_code: 345ns, path_prettifier: 244ns, filename_unadjuster: 235ns, autogenerated_exclude: 210ns, cgo: 201ns, path_shortener: 167ns, exclude: 167ns, identifier_marker: 164ns, max_per_file_from_linter: 157ns, diff: 155ns, uniq_by_line: 88ns, exclude-rules: 65ns"
level=info msg="[runner] linters took 51.601317902s with stages: goanalysis_metalinter: 48.456096815s, unused: 3.145112591s"
level=error msg="Running error: buildir: analysis skipped: errors in package: [/go/src/github.com/docker/app/e2e/helper_test.go:132:9: no result values expected]"
level=info msg="Memory: 1032 samples, avg is 224.6MB, max is 1083.4MB"
level=info msg="Execution took 2m4.177209843s"
make: *** [Makefile:70: lint] Error 3
docker.Makefile:93: recipe for target 'lint' failed
make: *** [lint] Error 2
[Pipeline] }
[Pipeline] // ansiColor
[Pipeline] }
[Pipeline] // dir
Post stage
[Pipeline] deleteDir
[Pipeline] }
[Pipeline] // node
[Pipeline] }
[Pipeline] // stage
[Pipeline] }
Failed in branch Validate
#20 12.35 go: downloading github.com/sirupsen/logrus v1.0.5
#20 12.35 go: downloading github.com/pkg/errors v0.8.1
#20 12.36 go: downloading github.com/jonboulle/clockwork v0.1.0
#20 12.36 go: downloading github.com/spf13/pflag v1.0.3
#20 12.36 go: downloading golang.org/x/sync v0.0.0-20190423024810-112230192c58
#20 12.38 go: downloading golang.org/x/crypto v0.0.0-20190308221718-c2843e01d9a2
#20 12.38 go: extracting github.com/pkg/errors v0.8.1
#20 12.44 go: extracting github.com/spf13/pflag v1.0.3
#20 12.45 go: downloading github.com/fatih/color v1.6.0
#20 12.47 go: extracting golang.org/x/sync v0.0.0-20190423024810-112230192c58
#20 12.47 go: extracting github.com/jonboulle/clockwork v0.1.0
#20 12.48 go: extracting github.com/sirupsen/logrus v1.0.5
#20 12.49 go: downloading golang.org/x/sys v0.0.0-20190215142949-d0b11bdaac8a
#20 12.77 go: extracting github.com/fatih/color v1.6.0
#20 12.77 go: downloading github.com/mattn/go-isatty v0.0.3
#20 12.78 go: downloading github.com/mattn/go-colorable v0.0.9
#20 12.82 go: extracting github.com/mattn/go-isatty v0.0.3
#20 12.82 go: extracting github.com/mattn/go-colorable v0.0.9
#20 13.21 go: extracting golang.org/x/crypto v0.0.0-20190308221718-c2843e01d9a2
#20 13.40 go: extracting golang.org/x/sys v0.0.0-20190215142949-d0b11bdaac8a
#20 13.47 go: finding github.com/fatih/color v1.6.0
#20 13.47 go: finding github.com/pkg/errors v0.8.1
#20 13.48 go: finding github.com/sirupsen/logrus v1.0.5
#20 13.49 go: finding github.com/spf13/pflag v1.0.3
#20 13.50 go: finding github.com/mattn/go-colorable v0.0.9
#20 13.50 go: finding github.com/mattn/go-isatty v0.0.3
#20 13.52 go: finding golang.org/x/crypto v0.0.0-20190308221718-c2843e01d9a2
#20 13.53 go: finding golang.org/x/sys v0.0.0-20190215142949-d0b11bdaac8a
#20 13.54 go: finding github.com/jonboulle/clockwork v0.1.0
#20 13.54 go: finding golang.org/x/sync v0.0.0-20190423024810-112230192c58
#20 DONE 35.7s

#21 [dev 7/9] RUN GOOS=linux go build -o /usr/local/bin/test2json-linux     ...
#21 DONE 1.9s

#22 [dev 8/9] RUN go get -d gopkg.in/mjibson/esc.v0 &&   cd /go/src/github.c...
#22 8.496 golang.org/x/mod/semver
#22 8.536 github.com/pkg/errors
#22 8.547 golang.org/x/xerrors/internal
#22 8.568 golang.org/x/xerrors
#22 8.589 golang.org/x/tools/go/ast/astutil
#22 8.678 golang.org/x/mod/module
#22 8.771 golang.org/x/tools/internal/telemetry/event
#22 8.941 golang.org/x/tools/internal/fastwalk
#22 9.000 golang.org/x/tools/internal/gopathwalk
#22 9.024 golang.org/x/tools/internal/gocommand
#22 9.075 golang.org/x/tools/internal/imports
#22 9.490 golang.org/x/tools/imports
#22 9.501 github.com/mjibson/esc/embed
#22 9.542 github.com/mjibson/esc
#22 DONE 10.4s

#24 [dev 9/9] COPY . .
#24 DONE 0.8s

#25 [cross-build 1/1] RUN make TAG=jenkins-app-PR-801-6 cross
#25 0.852 GOOS=linux CGO_ENABLED=0 go build -tags= -ldflags="-s -w -X github.com/docker/app/internal.GitCommit=a1df96ab -X github.com/docker/app/internal.Version=jenkins-app-PR-801-6" -o bin/docker-app-linux ./cmd/docker-app
#25 55.81 GOOS=darwin CGO_ENABLED=0 go build -tags= -ldflags="-s -w -X github.com/docker/app/internal.GitCommit=a1df96ab -X github.com/docker/app/internal.Version=jenkins-app-PR-801-6" -o bin/docker-app-darwin ./cmd/docker-app
#25 113.7 GOOS=windows CGO_ENABLED=0 go build -tags= -ldflags="-s -w -X github.com/docker/app/internal.GitCommit=a1df96ab -X github.com/docker/app/internal.Version=jenkins-app-PR-801-6" -o bin/docker-app-windows.exe ./cmd/docker-app
#25 172.7 GOOS=linux GOARCH=arm64 CGO_ENABLED=0 go build -tags= -ldflags="-s -w -X github.com/docker/app/internal.GitCommit=a1df96ab -X github.com/docker/app/internal.Version=jenkins-app-PR-801-6" -o bin/docker-app-linux-arm64 ./cmd/docker-app
#25 237.2 GOOS=linux GOARCH=arm CGO_ENABLED=0 go build -tags= -ldflags="-s -w -X github.com/docker/app/internal.GitCommit=a1df96ab -X github.com/docker/app/internal.Version=jenkins-app-PR-801-6" -o bin/docker-app-linux-arm ./cmd/docker-app
#25 DONE 302.1s

#26 [cross 1/5] COPY --from=cross-build /go/src/github.com/docker/app/bin/do...
#26 DONE 0.1s

#27 [cross 2/5] COPY --from=cross-build /go/src/github.com/docker/app/bin/do...
#27 DONE 0.2s

#28 [cross 3/5] COPY --from=cross-build /go/src/github.com/docker/app/bin/do...
#28 DONE 0.1s

#29 [cross 4/5] COPY --from=cross-build /go/src/github.com/docker/app/bin/do...
#29 DONE 0.2s

#30 [cross 5/5] COPY --from=cross-build /go/src/github.com/docker/app/bin/do...
#30 DONE 0.1s

#31 exporting to client
#31 copying files 12.55MB 0.1s
#31 copying files 197.43MB 1.3s done
#31 DONE 1.6s
docker build --build-arg TAG=jenkins-app-PR-801-6 --build-arg COMMIT=a1df96ab --build-arg ALPINE_VERSION=3.11.5 --build-arg GOPROXY=direct --output type=local,dest=./bin/ --target=e2e-cross -t docker-app-e2e-cross:jenkins-app-PR-801-6  .
#1 [internal] load .dockerignore
#1 transferring context: 34B done
#1 DONE 0.0s

#2 [internal] load build definition from Dockerfile
#2 transferring dockerfile: 38B done
#2 DONE 0.0s

#4 [internal] load metadata for docker.io/dockercore/golang-cross:1.13.10@s...
#4 DONE 0.0s

#3 [internal] load metadata for docker.io/library/golang:1.13.10
#3 DONE 0.1s

#8 [cli-build 1/10] FROM docker.io/dockercore/golang-cross:1.13.10@sha256:a...
#8 DONE 0.0s

#5 [dev 1/9] FROM docker.io/library/golang:1.13.10@sha256:81bd18af9605d1a47...
#5 DONE 0.0s

#23 [internal] load build context
#23 transferring context: 351.29kB 0.2s done
#23 DONE 0.2s

#22 [dev 8/9] RUN go get -d gopkg.in/mjibson/esc.v0 &&   cd /go/src/github.c...
#22 CACHED

#14 [cli-build 7/10] RUN curl -fL https://download.docker.com/linux/static/s...
#14 CACHED

#7 [dev 3/9] WORKDIR /go/src/github.com/docker/app/
#7 CACHED

#6 [dev 2/9] RUN apt-get update && apt-get install -y -q --no-install-recom...
#6 CACHED

#24 [dev 9/9] COPY . .
#24 CACHED

#18 [dev 4/9] COPY --from=cli-build /go/src/github.com/docker/cli/build/dock...
#18 CACHED

#21 [dev 7/9] RUN GOOS=linux go build -o /usr/local/bin/test2json-linux     ...
#21 CACHED

#19 [dev 5/9] RUN curl -o /usr/bin/dep -L https://github.com/golang/dep/rele...
#19 CACHED

#10 [cli-build 3/10] WORKDIR /go/src/github.com/docker/cli
#10 CACHED

#11 [cli-build 4/10] RUN git clone https://github.com/docker/cli . && git ch...
#11 CACHED

#12 [cli-build 5/10] RUN mkdir build
#12 CACHED

#15 [cli-build 8/10] RUN curl -fL https://download.docker.com/linux/static/s...
#15 CACHED

#9 [cli-build 2/10] RUN apt-get update && apt-get install -y -q --no-instal...
#9 CACHED

#17 [cli-build 10/10] RUN make binary-windows
#17 CACHED

#20 [dev 6/9] RUN mkdir /go/src/gotest.tools &&   git clone -q https://githu...
#20 CACHED

#16 [cli-build 9/10] RUN curl -fL https://download.docker.com/mac/static/sta...
#16 CACHED

#13 [cli-build 6/10] RUN curl -fL https://download.docker.com/linux/static/s...
#13 CACHED

#25 [cross-build 1/1] RUN make TAG=jenkins-app-PR-801-6 cross
#25 CACHED

#26 [e2e-cross-build 1/1] RUN make TAG=jenkins-app-PR-801-6 e2e-cross
#26 0.621 GOOS=linux CGO_ENABLED=0 go build -tags= -ldflags="-s -w -X github.com/docker/app/internal.GitCommit=a1df96ab -X github.com/docker/app/internal.Version=jenkins-app-PR-801-6" -o bin/docker-app-linux ./cmd/docker-app
#26 1.377 GOOS=linux CGO_ENABLED=0 go test -tags= -ldflags="-s -w -X github.com/docker/app/internal.GitCommit=a1df96ab -X github.com/docker/app/internal.Version=jenkins-app-PR-801-6" -c -o bin/docker-app-e2e-linux ./e2e/
#26 3.045 # github.com/docker/app/e2e [github.com/docker/app/e2e.test]
#26 3.045 e2e/helper_test.go:132:2: too many arguments to return
#26 3.045 	have (string)
#26 3.045 	want ()
#26 20.78 make: *** [Makefile:41: bin/docker-app-e2e-linux] Error 2
#26 ERROR: executor failed running [/bin/sh -c make TAG=${TAG} e2e-cross]: runc did not terminate sucessfully
------
 > [e2e-cross-build 1/1] RUN make TAG=jenkins-app-PR-801-6 e2e-cross:
------
failed to solve with frontend dockerfile.v0: failed to build LLB: executor failed running [/bin/sh -c make TAG=${TAG} e2e-cross]: runc did not terminate sucessfully
docker.Makefile:54: recipe for target 'e2e-cross' failed
make: *** [e2e-cross] Error 1
[Pipeline] }
[Pipeline] // ansiColor
[Pipeline] sh
+ xargs --no-run-if-empty docker image rm -f
+ docker image ls --format={{.Repository}}:{{.Tag}} *jenkins-app-PR-801-6*
[Pipeline] }
[Pipeline] // script
[Pipeline] }
[Pipeline] // dir
Post stage
[Pipeline] deleteDir
[Pipeline] }
[Pipeline] // node
[Pipeline] }
[Pipeline] // stage
[Pipeline] }
Failed in branch Binaries
[Pipeline] // parallel
[Pipeline] }
[Pipeline] // stage
[Pipeline] stage
[Pipeline] { (Test)
Stage "Test" skipped due to earlier failure(s)
[Pipeline] parallel
[Pipeline] { (Branch: Coverage)
[Pipeline] { (Branch: Test Linux)
[Pipeline] stage
[Pipeline] { (Coverage)
[Pipeline] stage
[Pipeline] { (Test Linux)
Stage "Coverage" skipped due to earlier failure(s)
[Pipeline] }
Stage "Test Linux" skipped due to earlier failure(s)
[Pipeline] }
[Pipeline] // stage
[Pipeline] // stage
[Pipeline] }
Failed in branch Coverage
[Pipeline] }
Failed in branch Test Linux
[Pipeline] // parallel
[Pipeline] }
[Pipeline] // stage
[Pipeline] }
[Pipeline] // timeout
[Pipeline] }
[Pipeline] // withEnv
[Pipeline] End of Pipeline

GitHub has been notified of this commit’s build result

ERROR: script returned exit code 2
Finished: FAILURE